{"text_format":"1","workbook":"xlsx","n_sheets":9,"sheets":["Fixtures","Grid","Ladders","Qualif","FinalsTop","McRopod","Module1","Times","LaddersH"],"not_rendered":{"charts":0,"images":0,"macros":1,"external_links":0,"defined_names":9,"comments":0,"pivot_tables":0},"unopened":[{"sheet":"Module1","index":6,"reason":"part_missing"}],"bounds":{"document_bytes":16777216,"sheet_cells":100000,"rows_first":2000,"rows_last":500,"rows_between":2000,"halvings":0,"cell_chars":16384,"cell_head_chars":4096},"cells_cut":0,"cells_raw":0,"read":"whole","date_system":"1900"}

{"sheet":"Fixtures","index":0,"n_rows":85,"n_cols":18,"rows_kept":85,"cut":false,"hidden":false,"merged":[]}
[{"$f":"McRopod!K1","v":"V1 - 221225"}]
[null,"Group","#","City","Local Date and Time",null,null,null,null,"Result"]
[null,null,1,"Mexico City","2026-06-11","13:00:00","Mexico","v","South Africa",null,null,null,null,"MEX","SAF",null,11,12]
[null,null,2,"Guadalajara","2026-06-11","20:00:00","South Korea","v","(DEN/MKD/CZE/IRL)",null,null,null,null,"SKO","UED",null,13,14]
[null,null,25,"Atlanta","2026-06-18","12:00:00",{"$f":"I4","v":"(DEN/MKD/CZE/IRL)"},"v","South Africa",null,null,null,null,"UAD","SAF",null,13,11]
[null,null,28,"Guadalajara","2026-06-18","19:00:00","Mexico","v","South Korea",null,null,null,null,"MEX","SOK",null,12,14]
[null,null,53,"Mexico City","2026-06-24","19:00:00",{"$f":"I4","v":"(DEN/MKD/CZE/IRL)"},"v","Mexico",null,null,null,null,"UED","MEX",null,12,13]
[null,null,54,"Monterrey","2026-06-24","19:00:00","South Africa","v","South Korea",null,null,null,null,"SAF","SOK",null,14,11]
[]
[null,null,3,"Toronto","2026-06-12","15:00:00","Canada","v","(ITA,NRL,WAL,BIH)",null,null,null,null,"CAN","UEA",null,21,22]
[null,null,8,"San Francisco Bay Area","2026-06-13","12:00:00","Qatar","v","Switzerland",null,null,null,null,"QAT","SWZ",null,23,24]
[null,null,26,"Los Angeles","2026-06-18","12:00:00","Switzerland","v",{"$f":"I10","v":"(ITA,NRL,WAL,BIH)"},null,null,null,null,"SWZ","UEA",null,24,22]
[null,null,27,"Vancouver","2026-06-18","15:00:00","Canada","v","Qatar",null,null,null,null,"CAN","QAT",null,21,23]
[null,null,51,"Vancouver","2026-06-24","12:00:00","Switzerland","v","Canada",null,null,null,null,"SWZ","CAN",null,24,21]
[null,null,52,"Seattle","2026-06-24","12:00:00",{"$f":"I10","v":"(ITA,NRL,WAL,BIH)"},"v","Qatar",null,null,null,null,"UEA","QAT",null,22,23]
[]
[null,null,7,"New York/New Jersey","2026-06-13","18:00:00","Brazil","v","Morocco",null,null,null,null,"BRA","MOR",null,31,32]
[null,null,5,"Boston","2026-06-13","21:00:00","Haiti","v","Scotland",null,null,null,null,"HAI","SCO",null,33,34]
[null,null,30,"Boston","2026-06-19","18:00:00","Scotland","v","Morocco",null,null,null,null,"SCO","MOR",null,34,32]
[null,null,29,"Philadelphia","2026-06-19","21:00:00","Brazil","v","Haiti",null,null,null,null,"BRA","HAI",null,31,33]
[null,null,49,"Miami","2026-06-24","18:00:00","Scotland","v","Brazil",null,null,null,null,"SCO","BRA",null,34,31]
[null,null,50,"Atlanta","2026-06-24","18:00:00","Morocco","v","Haiti",null,null,null,null,"MOR","HAI",null,32,33]
[]
[null,null,4,"Los Angeles","2026-06-12","18:00:00","USA","v","Paraguay",null,null,null,null,"USA","PAR",null,41,42]
[null,null,6,"Vancouver","2026-06-13","21:00:00","Australia","v","(TUR,ROM,SVK,KOS)",null,null,null,null,"AUS","UEC",null,43,44]
[null,null,32,"Seattle","2026-06-19","12:00:00","USA","v","Australia",null,null,null,null,"USA","AUS",null,42,44]
[null,null,31,"San Francisco Bay Area","2026-06-19","21:00:00",{"$f":"I25","v":"(TUR,ROM,SVK,KOS)"},"v","Paraguay",null,null,null,null,"UAC","PAR",null,43,41]
[null,null,59,"Los Angeles","2026-06-25","19:00:00",{"$f":"I25","v":"(TUR,ROM,SVK,KOS)"},"v","USA",null,null,null,null,"UEC","USA",null,42,43]
[null,null,60,"San Francisco Bay Area","2026-06-25","19:00:00","Paraguay","v","Australia",null,null,null,null,"PAR","AUS",null,44,41]
[]
[null,null,10,"Houston","2026-06-14","12:00:00","Germany","v","Curaçao",null,null,null,null,"GER","CUR",null,51,52]
[null,null,9,"Philadelphia","2026-06-14","19:00:00","Côte d'Ivoire","v","Ecuador",null,null,null,null,"IVO","EQA",null,53,54]
[null,null,33,"Toronto","2026-06-20","16:00:00","Germany","v","Côte d'Ivoire",null,null,null,null,"GER","IVO",null,52,54]
[null,null,34,"Kansas City","2026-06-20","19:00:00","Ecuador","v","Curaçao",null,null,null,null,"EQA","CUR",null,53,51]
[null,null,55,"Philadelphia","2026-06-25","16:00:00","Curaçao","v","Côte d'Ivoire",null,null,null,null,"CUR","IVO",null,52,53]
[null,null,56,"New York/New Jersey","2026-06-25","16:00:00","Ecuador","v","Germany",null,null,null,null,"EQA","GER",null,54,51]
[]
[null,null,11,"Dallas","2026-06-14","15:00:00","Netherlands","v","Japan",null,null,null,null,"NET","JAP",null,8,5]
[null,null,12,"Monterrey","2026-06-14","20:00:00","(UKR,SWE,POL,ALB)","v","Tunisia",null,null,null,null,"UAB","TUN",null,4,2]
[null,null,35,"Houston","2026-06-20","12:00:00","Netherlands","v",{"$f":"G39","v":"(UKR,SWE,POL,ALB)"},null,null,null,null,"NET","UEB",null,8,4]
[null,null,36,"Monterrey","2026-06-20","22:00:00","Tunisia","v","Japan",null,null,null,null,"TUN","JAP",null,2,5]
[null,null,57,"Dallas","2026-06-25","18:00:00","Japan","v",{"$f":"G39","v":"(UKR,SWE,POL,ALB)"},null,null,null,null,"JAP","UEB",null,5,4]
[null,null,58,"Kansas City","2026-06-25","18:00:00","Tunisia","v","Netherlands",null,null,null,null,"TUN","NET",null,2,8]
[]
[null,null,16,"Seattle","2026-06-15","12:00:00","Belgium","v","Egypt",null,null,null,null,"BEL","EGY",null,71,72]
[null,null,15,"Los Angeles","2026-06-15","18:00:00","Iran","v","NewZealand",null,null,null,null,"IRN","NZL",null,73,74]
[null,null,39,"Los Angeles","2026-06-21","12:00:00","Belgium","v","Iran",null,null,null,null,"BEL","IRN",null,72,74]
[null,null,40,"Vancouver","2026-06-21","18:00:00","New Zealand","v","Egypt",null,null,null,null,"NZL","EGY",null,73,71]
[null,null,63,"Seattle","2026-06-26","20:00:00","Egypt","v","Iran",null,null,null,null,"EGY","IRN",null,72,73]
[null,null,64,"Vancouver","2026-06-26","20:00:00","New Zealand","v","Belgium",null,null,null,null,"NZL","BEL",null,74,71]
[]
[null,null,14,"Atlanta","2026-06-15","12:00:00","Spain","v","Cape Verde",null,null,null,null,"ESP","VER",null,81,82]
[null,null,13,"Miami","2026-06-15","18:00:00","Saudi Arabia","v","Uruguay",null,null,null,null,"SAU","URU",null,83,84]
[null,null,38,"Atlanta","2026-06-21","12:00:00","Spain","v","Saudi Arabia",null,null,null,null,"ESP","SAU",null,82,84]
[null,null,37,"Miami","2026-06-21","18:00:00","Uruguay","v","Cape Verde",null,null,null,null,"URU","VER",null,83,81]
[null,null,66,"Guadalajara","2026-06-26","18:00:00","Uruguay","v","Spain",null,null,null,null,"URU","ESP",null,82,83]
[null,null,65,"Houston","2026-06-26","19:00:00","Cape Verde","v","Saudi Arabia",null,null,null,null,"VER","SAU",null,84,81]
[]
[null,null,17,"New York/New Jersey","2026-06-16","15:00:00","France","v","Senegal",null,null,null,null,"FRA","SEN",null,91,92]
[null,null,18,"Boston","2026-06-16","18:00:00","(BOL,SUR,IRQ)","v","Norway",null,null,null,null,"IC2","NOR",null,93,94]
[null,null,42,"Philadelphia","2026-06-22","17:00:00","France","v",{"$f":"G60","v":"(BOL,SUR,IRQ)"},null,null,null,null,"FRA","IC2",null,92,94]
[null,null,41,"New York/New Jersey","2026-06-22","20:00:00","Norway","v","Senegal",null,null,null,null,"NOR","SEN",null,93,91]
[null,null,61,"Boston","2026-06-26","15:00:00","Norway","v","France",null,null,null,null,"NOR","FRA",null,92,93]
[null,null,62,"Toronto","2026-06-26","15:00:00","Senegal","v",{"$f":"G60","v":"(BOL,SUR,IRQ)"},null,null,null,null,"SEN","IC2",null,94,91]
[]
[null,null,19,"Kansas City","2026-06-16","20:00:00","Argentina","v","Algeria",null,null,null,null,"ARG","ALG",null,101,102]
[null,null,20,"San Francisco Bay Area","2026-06-16","21:00:00","Austria","v","Jordan",null,null,null,null,"AUT","JOR",null,103,104]
[null,null,43,"Dallas","2026-06-22","12:00:00","Argentina","v","Austria",null,null,null,null,"ARG","AUT",null,102,104]
[null,null,44,"San Francisco Bay Area","2026-06-22","20:00:00","Jordan","v","Algeria",null,null,null,null,"JOR","ALG",null,103,101]
[null,null,69,"Kansas City","2026-06-27","21:00:00","Algeria","v","Austria",null,null,null,null,"ALG","AUT",null,102,103]
[null,null,70,"Dallas","2026-06-27","21:00:00","Jordan","v","Argentina",null,null,null,null,"JOR","ARG",null,104,101]
[]
[null,null,23,"Houston","2026-06-17","12:00:00","Portugal","v","(NCL,JAM,COD)",null,null,null,null,"POR","IC1",null,111,112]
[null,null,24,"Mexico City","2026-06-17","20:00:00","Uzbekistan","v","Colombia",null,null,null,null,"UZB","COL",null,113,114]
[null,null,47,"Houston","2026-06-23","12:00:00","Portugal","v","Uzbekistan",null,null,null,null,"POR","UZB",null,112,114]
[null,null,48,"Guadalajara","2026-06-23","20:00:00","Colombia","v",{"$f":"I73","v":"(NCL,JAM,COD)"},null,null,null,null,"COL","IC1",null,113,111]
[null,null,71,"Miami","2026-06-27","19:30:00","Colombia","v","Portugal",null,null,null,null,"COL","POR",null,112,113]
[null,null,72,"Atlanta","2026-06-27","19:30:00",{"$f":"I73","v":"(NCL,JAM,COD)"},"v","Uzbekistan",null,null,null,null,"IC1","UZB",null,114,111]
[]
[null,null,22,"Dallas","2026-06-17","15:00:00","England","v","Croatia",null,null,null,null,"ENG","CRO",null,121,122]
[null,null,21,"Toronto","2026-06-17","19:00:00","Ghana","v","Panama",null,null,null,null,"GHA","PAN",null,123,124]
[null,null,45,"Boston","2026-06-23","16:00:00","England","v","Ghana",null,null,null,null,"ENG","GHA",null,122,124]
[null,null,46,"Toronto","2026-06-23","19:00:00","Panama","v","Croatia",null,null,null,null,"PAN","CRO",null,123,121]
[null,null,67,"New York/New Jersey","2026-06-27","17:00:00","Panama","v","England",null,null,null,null,"PAN","ENG",null,122,123]
[null,null,68,"Philadelphia","2026-06-27","17:00:00","Croatia","v","Ghana",null,null,null,null,"CRO","GHA",null,124,121]

{"sheet":"Grid","index":1,"n_rows":84,"n_cols":23,"rows_kept":84,"cut":false,"hidden":true,"merged":[]}
[]
["A",{"$f":"P7","v":"Incomplete"},null,{"$f":"B3","v":"South Korea"},null,null,{"$f":"B4","v":"(DEN/MKD/CZE/IRL)"},null,null,{"$f":"B5","v":"Mexico"},null,null,{"$f":"B6","v":"South Africa"},null,null,"P","W","D","L","F","A","GD","Pts"]
[null,{"$f":"Fixtures!G4","v":"South Korea"},null,null,null,{"$f":"IF(Fixtures!$J$4=\"\",\"\",Fixtures!$J$4)","v":""},{"$f":"IF(Fixtures!$K$4=\"\",\"\",Fixtures!$K$4)","v":""},{"$f":"IF(F3=\"\",\"\",IF(G3=\"\",\"\",IF(F3>G3,\"W\",IF(F3=G3,\"D\",IF(F3<G3,\"L\",\"\")))))","v":""},null,null,{"$f":"IF(I3=\"\",\"\",IF(J3=\"\",\"\",IF(I3>J3,\"W\",IF(I3=J3,\"D\",IF(I3<J3,\"L\",\"\")))))","v":""},{"$f":"IF(Fixtures!$K$8=\"\",\"\",Fixtures!$K$8)","v":""},{"$f":"IF(Fixtures!$J$8=\"\",\"\",Fixtures!$J$8)","v":""},{"$f":"IF(L3=\"\",\"\",IF(M3=\"\",\"\",IF(L3>M3,\"W\",IF(L3=M3,\"D\",IF(L3<M3,\"L\",\"\")))))","v":""},null,{"$f":"SUM(Q3)+SUM(R3)+SUM(S3)","v":0},{"$f":"IF(E5=\"L\",1,0)+IF(H3=\"W\",1,0)+IF(N3=\"W\",1,0)","v":0},{"$f":"IF(H3=\"D\",1,0)+IF(E5=\"D\",1,0)+IF(N3=\"D\",1,0)","v":0},{"$f":"IF(E5=\"W\",1,0)+IF(H3=\"L\",1,0)+IF(N3=\"L\",1,0)","v":0},{"$f":"SUM(F3)+SUM(D5)+SUM(L3)","v":0},{"$f":"SUM(G3)+SUM(C5)+SUM(M3)","v":0},{"$f":"T3-U3","v":0},{"$f":"SUM(Q3*3)+SUM(R3)","v":0}]
[null,{"$f":"Fixtures!I4","v":"(DEN/MKD/CZE/IRL)"},null,null,null,null,null,null,{"$f":"IF(Fixtures!$J$7=\"\",\"\",Fixtures!$J$7)","v":""},{"$f":"IF(Fixtures!$K$7=\"\",\"\",Fixtures!$K$7)","v":""},{"$f":"IF(I4=\"\",\"\",IF(J4=\"\",\"\",IF(I4>J4,\"W\",IF(I4=J4,\"D\",IF(I4<J4,\"L\",\"\")))))","v":""},null,null,null,null,{"$f":"SUM(Q4)+SUM(R4)+SUM(S4)","v":0},{"$f":"IF(H3=\"L\",1,0)+IF(H6=\"L\",1,0)+IF(K4=\"W\",1,0)","v":0},{"$f":"IF(H3=\"D\",1,0)+IF(H6=\"D\",1,0)+IF(K4=\"D\",1,0)","v":0},{"$f":"IF(H3=\"W\",1,0)+IF(H6=\"W\",1,0)+IF(K4=\"L\",1,0)","v":0},{"$f":"SUM(G3)+SUM(I4)+SUM(G6)","v":0},{"$f":"SUM(F3)+SUM(J4)+SUM(F6)","v":0},{"$f":"T4-U4","v":0},{"$f":"SUM(Q4*3)+SUM(R4)","v":0}]
[null,{"$f":"Fixtures!G3","v":"Mexico"},{"$f":"IF(Fixtures!$J$6=\"\",\"\",Fixtures!$J$6)","v":""},{"$f":"IF(Fixtures!$K$6=\"\",\"\",Fixtures!$K$6)","v":""},{"$f":"IF(C5=\"\",\"\",IF(D5=\"\",\"\",IF(C5>D5,\"W\",IF(C5=D5,\"D\",IF(C5<D5,\"L\",\"\")))))","v":""},null,null,{"$f":"IF(F5=\"\",\"\",IF(G5=\"\",\"\",IF(F5>G5,\"W\",IF(F5=G5,\"D\",IF(F5<G5,\"L\",\"\")))))","v":""},null,null,null,{"$f":"IF(Fixtures!$J$3=\"\",\"\",Fixtures!$J$3)","v":""},{"$f":"IF(Fixtures!$K$3=\"\",\"\",Fixtures!$K$3)","v":""},{"$f":"IF(L5=\"\",\"\",IF(M5=\"\",\"\",IF(L5>M5,\"W\",IF(L5=M5,\"D\",IF(L5<M5,\"L\",\"\")))))","v":""},null,{"$f":"SUM(Q5)+SUM(R5)+SUM(S5)","v":0},{"$f":"IF(E5=\"W\",1,0)+IF(K4=\"L\",1,0)+IF(N5=\"W\",1,0)","v":0},{"$f":"IF(E5=\"D\",1,0)+IF(K4=\"D\",1,0)+IF(N5=\"D\",1,0)","v":0},{"$f":"IF(E5=\"L\",1,0)+IF(K4=\"W\",1,0)+IF(N5=\"L\",1,0)","v":0},{"$f":"SUM(C5)+SUM(J4)+SUM(L5)","v":0},{"$f":"SUM(D5)+SUM(I4)+SUM(M5)","v":0},{"$f":"T5-U5","v":0},{"$f":"SUM(Q5*3)+SUM(R5)","v":0}]
[null,{"$f":"Fixtures!I3","v":"South Africa"},null,null,{"$f":"IF(C6=\"\",\"\",IF(D6=\"\",\"\",IF(C6>D6,\"W\",IF(C6=D6,\"D\",IF(C6<D6,\"L\",\"\")))))","v":""},{"$f":"IF(Fixtures!$K$5=\"\",\"\",Fixtures!$K$5)","v":""},{"$f":"IF(Fixtures!$J$5=\"\",\"\",Fixtures!$J$5)","v":""},{"$f":"IF(F6=\"\",\"\",IF(G6=\"\",\"\",IF(F6>G6,\"W\",IF(F6=G6,\"D\",IF(F6<G6,\"L\",\"\")))))","v":""},null,null,null,null,null,null,null,{"$f":"SUM(Q6)+SUM(R6)+SUM(S6)","v":0},{"$f":"IF(N3=\"L\",1,0)+IF(H6=\"W\",1,0)+IF(N5=\"L\",1,0)","v":0},{"$f":"IF(N3=\"D\",1,0)+IF(H6=\"D\",1,0)+IF(N5=\"D\",1,0)","v":0},{"$f":"IF(N3=\"W\",1,0)+IF(H6=\"L\",1,0)+IF(N5=\"W\",1,0)","v":0},{"$f":"SUM(M3)+SUM(F6)+SUM(M5)","v":0},{"$f":"SUM(L3)+SUM(G6)+SUM(L5)","v":0},{"$f":"T6-U6","v":0},{"$f":"SUM(Q6*3)+SUM(R6)","v":0}]
[null,null,null,null,null,null,null,null,null,null,null,null,null,null,null,{"$f":"IF(SUM(P3:P6)=12,\"Final Table\",\"Incomplete\")","v":"Incomplete"}]
[]
["B",{"$f":"P14","v":"Incomplete"},null,{"$f":"B10","v":"Qatar"},null,null,{"$f":"B11","v":"Canada"},null,null,{"$f":"B12","v":"Switzerland"},null,null,{"$f":"B13","v":"(ITA,NRL,WAL,BIH)"},null,null,"P","W","D","L","F","A","GD","Pts"]
[null,{"$f":"Fixtures!G11","v":"Qatar"},null,null,null,null,null,null,{"$f":"IF(Fixtures!$J$11=\"\",\"\",Fixtures!$J$11)","v":""},{"$f":"IF(Fixtures!$K$11=\"\",\"\",Fixtures!$K$11)","v":""},{"$f":"IF(I10=\"\",\"\",IF(J10=\"\",\"\",IF(I10>J10,\"W\",IF(I10=J10,\"D\",IF(I10<J10,\"L\",\"\")))))","v":""},{"$f":"IF(Fixtures!$K$15=\"\",\"\",Fixtures!$K$15)","v":""},{"$f":"IF(Fixtures!$J$15=\"\",\"\",Fixtures!$J$15)","v":""},{"$f":"IF(L10=\"\",\"\",IF(M10=\"\",\"\",IF(L10>M10,\"W\",IF(L10=M10,\"D\",IF(L10<M10,\"L\",\"\")))))","v":""},null,{"$f":"SUM(Q10)+SUM(R10)+SUM(S10)","v":0},{"$f":"IF(E11=\"L\",1,0)+IF(K10=\"W\",1,0)+IF(N10=\"W\",1,0)","v":0},{"$f":"IF(E11=\"D\",1,0)+IF(K10=\"D\",1,0)+IF(N10=\"D\",1,0)","v":0},{"$f":"IF(E11=\"W\",1,0)+IF(K10=\"L\",1,0)+IF(N10=\"L\",1,0)","v":0},{"$f":"SUM(D11)+SUM(I10)+SUM(L10)","v":0},{"$f":"SUM(C11)+SUM(J10)+SUM(M10)","v":0},{"$f":"T10-U10","v":0},{"$f":"SUM(Q10*3)+SUM(R10)","v":0}]
[null,{"$f":"Fixtures!G10","v":"Canada"},{"$f":"IF(Fixtures!$J$13=\"\",\"\",Fixtures!$J$13)","v":""},{"$f":"IF(Fixtures!$K$13=\"\",\"\",Fixtures!$K$13)","v":""},{"$f":"IF(C11=\"\",\"\",IF(D11=\"\",\"\",IF(C11>D11,\"W\",IF(C11=D11,\"D\",IF(C11<D11,\"L\",\"\")))))","v":""},null,null,null,{"$f":"IF(Fixtures!$K$14=\"\",\"\",Fixtures!$K$14)","v":""},{"$f":"IF(Fixtures!$J$14=\"\",\"\",Fixtures!$J$14)","v":""},{"$f":"IF(I11=\"\",\"\",IF(J11=\"\",\"\",IF(I11>J11,\"W\",IF(I11=J11,\"D\",IF(I11<J11,\"L\",\"\")))))","v":""},{"$f":"IF(Fixtures!$J$10=\"\",\"\",Fixtures!$J$10)","v":""},{"$f":"IF(Fixtures!$K$10=\"\",\"\",Fixtures!$K$10)","v":""},{"$f":"IF(L11=\"\",\"\",IF(M11=\"\",\"\",IF(L11>M11,\"W\",IF(L11=M11,\"D\",IF(L11<M11,\"L\",\"\")))))","v":""},null,{"$f":"SUM(Q11)+SUM(R11)+SUM(S11)","v":0},{"$f":"IF(E11=\"W\",1,0)+IF(K11=\"W\",1,0)+IF(N11=\"W\",1,0)","v":0},{"$f":"IF(E11=\"D\",1,0)+IF(K11=\"D\",1,0)+IF(N11=\"D\",1,0)","v":0},{"$f":"IF(E11=\"L\",1,0)+IF(K11=\"L\",1,0)+IF(N11=\"L\",1,0)","v":0},{"$f":"SUM(C11)+SUM(I11)+SUM(L11)","v":0},{"$f":"SUM(D11)+SUM(J11)+SUM(M11)","v":0},{"$f":"T11-U11","v":0},{"$f":"SUM(Q11*3)+SUM(R11)","v":0}]
[null,{"$f":"Fixtures!I11","v":"Switzerland"},null,null,null,null,null,null,null,null,null,null,null,null,null,{"$f":"SUM(Q12)+SUM(R12)+SUM(S12)","v":0},{"$f":"IF(K10=\"L\",1,0)+IF(K11=\"L\",1,0)+IF(K13=\"L\",1,0)","v":0},{"$f":"IF(K10=\"D\",1,0)+IF(K11=\"D\",1,0)+IF(K13=\"D\",1,0)","v":0},{"$f":"IF(K10=\"W\",1,0)+IF(K11=\"W\",1,0)+IF(K13=\"W\",1,0)","v":0},{"$f":"SUM(J10)+SUM(J11)+SUM(J13)","v":0},{"$f":"SUM(I10)+SUM(I11)+SUM(I13)","v":0},{"$f":"T12-U12","v":0},{"$f":"SUM(Q12*3)+SUM(R12)","v":0}]
[null,{"$f":"Fixtures!I10","v":"(ITA,NRL,WAL,BIH)"},null,null,null,null,null,null,{"$f":"IF(Fixtures!$K$12=\"\",\"\",Fixtures!$K$12)","v":""},{"$f":"IF(Fixtures!$J$12=\"\",\"\",Fixtures!$J$12)","v":""},{"$f":"IF(I13=\"\",\"\",IF(J13=\"\",\"\",IF(I13>J13,\"W\",IF(I13=J13,\"D\",IF(I13<J13,\"L\",\"\")))))","v":""},null,null,{"$f":"IF(L13=\"\",\"\",IF(M13=\"\",\"\",IF(L13>M13,\"W\",IF(L13=M13,\"D\",IF(L13<M13,\"L\",\"\")))))","v":""},null,{"$f":"SUM(Q13)+SUM(R13)+SUM(S13)","v":0},{"$f":"IF(N10=\"L\",1,0)+IF(N11=\"L\",1,0)+IF(K13=\"L\",1,0)","v":0},{"$f":"IF(N10=\"D\",1,0)+IF(N11=\"D\",1,0)+IF(K13=\"D\",1,0)","v":0},{"$f":"IF(N10=\"W\",1,0)+IF(N11=\"W\",1,0)+IF(K13=\"W\",1,0)","v":0},{"$f":"SUM(M10)+SUM(M11)+SUM(I13)","v":0},{"$f":"SUM(L10)+SUM(L11)+SUM(J13)","v":0},{"$f":"T13-U13","v":0},{"$f":"SUM(Q13*3)+SUM(R13)","v":0}]
[null,null,null,null,null,null,null,null,null,null,null,null,null,null,null,{"$f":"IF(SUM(P10:P13)=12,\"Final Table\",\"Incomplete\")","v":"Incomplete"}]
[]
["C",{"$f":"P21","v":"Incomplete"},null,{"$f":"B17","v":"Haiti"},null,null,{"$f":"B18","v":"Scotland"},null,null,{"$f":"B19","v":"Brazil"},null,null,{"$f":"B20","v":"Morocco"},null,null,"P","W","D","L","F","A","GD","Pts"]
[null,{"$f":"Fixtures!G18","v":"Haiti"},null,null,null,{"$f":"IF(Fixtures!$J$18=\"\",\"\",Fixtures!$J$18)","v":""},{"$f":"IF(Fixtures!$K$18=\"\",\"\",Fixtures!$K$18)","v":""},{"$f":"IF(F17=\"\",\"\",IF(G17=\"\",\"\",IF(F17>G17,\"W\",IF(F17=G17,\"D\",IF(F17<G17,\"L\",\"\")))))","v":""},null,null,null,{"$f":"IF(Fixtures!$K$22=\"\",\"\",Fixtures!$K$22)","v":""},{"$f":"IF(Fixtures!$J$22=\"\",\"\",Fixtures!$J$22)","v":""},{"$f":"IF(L17=\"\",\"\",IF(M17=\"\",\"\",IF(L17>M17,\"W\",IF(L17=M17,\"D\",IF(L17<M17,\"L\",\"\")))))","v":""},null,{"$f":"SUM(Q17)+SUM(R17)+SUM(S17)","v":0},{"$f":"IF(H17=\"W\",1,0)+IF(N17=\"W\",1,0)+IF(E19=\"L\",1,0)","v":0},{"$f":"IF(H17=\"D\",1,0)+IF(N17=\"D\",1,0)+IF(E19=\"D\",1,0)","v":0},{"$f":"IF(H17=\"L\",1,0)+IF(N17=\"L\",1,0)+IF(E19=\"W\",1,0)","v":0},{"$f":"SUM(F17)+SUM(L17)+SUM(D19)","v":0},{"$f":"SUM(G17)+SUM(M17)+SUM(C19)","v":0},{"$f":"T17-U17","v":0},{"$f":"SUM(Q17*3)+SUM(R17)","v":0}]
[null,{"$f":"Fixtures!I18","v":"Scotland"},null,null,null,null,null,null,{"$f":"IF(Fixtures!$J$21=\"\",\"\",Fixtures!$J$21)","v":""},{"$f":"IF(Fixtures!$K$21=\"\",\"\",Fixtures!$K$21)","v":""},{"$f":"IF(I18=\"\",\"\",IF(J18=\"\",\"\",IF(I18>J18,\"W\",IF(I18=J18,\"D\",IF(I18<J18,\"L\",\"\")))))","v":""},null,null,{"$f":"IF(L18=\"\",\"\",IF(M18=\"\",\"\",IF(L18>M18,\"W\",IF(L18=M18,\"D\",IF(L18<M18,\"L\",\"\")))))","v":""},null,{"$f":"SUM(Q18)+SUM(R18)+SUM(S18)","v":0},{"$f":"IF(H17=\"L\",1,0)+IF(K18=\"W\",1,0)+IF(H20=\"L\",1,0)","v":0},{"$f":"IF(H17=\"D\",1,0)+IF(K18=\"D\",1,0)+IF(H20=\"D\",1,0)","v":0},{"$f":"IF(H17=\"W\",1,0)+IF(K18=\"L\",1,0)+IF(H20=\"W\",1,0)","v":0},{"$f":"SUM(G17)+SUM(G20)+SUM(I18)","v":0},{"$f":"SUM(F17)+SUM(F20)+SUM(J18)","v":0},{"$f":"T18-U18","v":0},{"$f":"SUM(Q18*3)+SUM(R18)","v":0}]
[null,{"$f":"Fixtures!G17","v":"Brazil"},{"$f":"IF(Fixtures!$J$20=\"\",\"\",Fixtures!$J$20)","v":""},{"$f":"IF(Fixtures!$K$20=\"\",\"\",Fixtures!$K$20)","v":""},{"$f":"IF(C19=\"\",\"\",IF(D19=\"\",\"\",IF(C19>D19,\"W\",IF(C19=D19,\"D\",IF(C19<D19,\"L\",\"\")))))","v":""},null,null,{"$f":"IF(F19=\"\",\"\",IF(G19=\"\",\"\",IF(F19>G19,\"W\",IF(F19=G19,\"D\",IF(F19<G19,\"L\",\"\")))))","v":""},null,null,null,{"$f":"IF(Fixtures!$J$17=\"\",\"\",Fixtures!$J$17)","v":""},{"$f":"IF(Fixtures!$K$17=\"\",\"\",Fixtures!$K$17)","v":""},{"$f":"IF(L19=\"\",\"\",IF(M19=\"\",\"\",IF(L19>M19,\"W\",IF(L19=M19,\"D\",IF(L19<M19,\"L\",\"\")))))","v":""},null,{"$f":"SUM(Q19)+SUM(R19)+SUM(S19)","v":0},{"$f":"IF(K18=\"L\",1,0)+IF(E19=\"W\",1,0)+IF(N19=\"W\",1,0)","v":0},{"$f":"IF(K18=\"D\",1,0)+IF(E19=\"D\",1,0)+IF(N19=\"D\",1,0)","v":0},{"$f":"IF(K18=\"W\",1,0)+IF(E19=\"L\",1,0)+IF(N19=\"L\",1,0)","v":0},{"$f":"SUM(J18)+SUM(C19)+SUM(L19)","v":0},{"$f":"SUM(I18)+SUM(D19)+SUM(M19)","v":0},{"$f":"T19-U19","v":0},{"$f":"SUM(Q19*3)+SUM(R19)","v":0}]
[null,{"$f":"Fixtures!I17","v":"Morocco"},null,null,{"$f":"IF(C20=\"\",\"\",IF(D20=\"\",\"\",IF(C20>D20,\"W\",IF(C20=D20,\"D\",IF(C20<D20,\"L\",\"\")))))","v":""},{"$f":"IF(Fixtures!$K$19=\"\",\"\",Fixtures!$K$19)","v":""},{"$f":"IF(Fixtures!$J$19=\"\",\"\",Fixtures!$J$19)","v":""},{"$f":"IF(F20=\"\",\"\",IF(G20=\"\",\"\",IF(F20>G20,\"W\",IF(F20=G20,\"D\",IF(F20<G20,\"L\",\"\")))))","v":""},null,null,null,null,null,null,null,{"$f":"SUM(Q20)+SUM(R20)+SUM(S20)","v":0},{"$f":"IF(H20=\"W\",1,0)+IF(N17=\"L\",1,0)+IF(N19=\"L\",1,0)","v":0},{"$f":"IF(H20=\"D\",1,0)+IF(N17=\"D\",1,0)+IF(N19=\"D\",1,0)","v":0},{"$f":"IF(H20=\"L\",1,0)+IF(N17=\"W\",1,0)+IF(N19=\"W\",1,0)","v":0},{"$f":"SUM(F20)+SUM(M17)+SUM(M19)","v":0},{"$f":"SUM(G20)+SUM(L17)+SUM(L19)","v":0},{"$f":"T20-U20","v":0},{"$f":"SUM(Q20*3)+SUM(R20)","v":0}]
[null,null,null,null,null,null,null,null,null,null,null,null,null,null,null,{"$f":"IF(SUM(P17:P20)=12,\"Final Table\",\"Incomplete\")","v":"Incomplete"}]
[]
["D",{"$f":"P28","v":"Incomplete"},null,{"$f":"B24","v":"(TUR,ROM,SVK,KOS)"},null,null,{"$f":"B25","v":"Australia"},null,null,{"$f":"B26","v":"USA"},null,null,{"$f":"B27","v":"Paraguay"},null,null,"P","W","D","L","F","A","GD","Pts"]
[null,{"$f":"Fixtures!I25","v":"(TUR,ROM,SVK,KOS)"},null,null,null,{"$f":"IF(Fixtures!$K$25=\"\",\"\",Fixtures!$K$25)","v":""},{"$f":"IF(Fixtures!$J$25=\"\",\"\",Fixtures!$J$25)","v":""},{"$f":"IF(F24=\"\",\"\",IF(G24=\"\",\"\",IF(F24>G24,\"W\",IF(F24=G24,\"D\",IF(F24<G24,\"L\",\"\")))))","v":""},{"$f":"IF(Fixtures!$J$28=\"\",\"\",Fixtures!$J$28)","v":""},{"$f":"IF(Fixtures!$K$28=\"\",\"\",Fixtures!$K$28)","v":""},{"$f":"IF(I24=\"\",\"\",IF(J24=\"\",\"\",IF(I24>J24,\"W\",IF(I24=J24,\"D\",IF(I24<J24,\"L\",\"\")))))","v":""},{"$f":"IF(Fixtures!$J$27=\"\",\"\",Fixtures!$J$27)","v":""},{"$f":"IF(Fixtures!$K$27=\"\",\"\",Fixtures!$K$27)","v":""},{"$f":"IF(L24=\"\",\"\",IF(M24=\"\",\"\",IF(L24>M24,\"W\",IF(L24=M24,\"D\",IF(L24<M24,\"L\",\"\")))))","v":""},null,{"$f":"SUM(Q24)+SUM(R24)+SUM(S24)","v":0},{"$f":"IF(H24=\"W\",1,0)+IF(K24=\"W\",1,0)+IF(N24=\"W\",1,0)","v":0},{"$f":"IF(H24=\"D\",1,0)+IF(K24=\"D\",1,0)+IF(N24=\"D\",1,0)","v":0},{"$f":"IF(H24=\"L\",1,0)+IF(K24=\"L\",1,0)+IF(N24=\"L\",1,0)","v":0},{"$f":"SUM(F24)+SUM(I24)+SUM(L24)","v":0},{"$f":"SUM(G24)+SUM(J24)+SUM(M24)","v":0},{"$f":"T24-U24","v":0},{"$f":"SUM(Q24*3)+SUM(R24)","v":0}]
[null,{"$f":"Fixtures!G25","v":"Australia"},null,null,null,null,null,null,{"$f":"IF(Fixtures!$K$26=\"\",\"\",Fixtures!$K$26)","v":""},{"$f":"IF(Fixtures!$J$26=\"\",\"\",Fixtures!$J$26)","v":""},{"$f":"IF(I25=\"\",\"\",IF(J25=\"\",\"\",IF(I25>J25,\"W\",IF(I25=J25,\"D\",IF(I25<J25,\"L\",\"\")))))","v":""},{"$f":"IF(Fixtures!$K$29=\"\",\"\",Fixtures!$K$29)","v":""},{"$f":"IF(Fixtures!$J$29=\"\",\"\",Fixtures!$J$29)","v":""},{"$f":"IF(L25=\"\",\"\",IF(M25=\"\",\"\",IF(L25>M25,\"W\",IF(L25=M25,\"D\",IF(L25<M25,\"L\",\"\")))))","v":""},null,{"$f":"SUM(Q25)+SUM(R25)+SUM(S25)","v":0},{"$f":"IF(H24=\"L\",1,0)+IF(K25=\"W\",1,0)+IF(N25=\"W\",1,0)","v":0},{"$f":"IF(H24=\"D\",1,0)+IF(K25=\"D\",1,0)+IF(N25=\"D\",1,0)","v":0},{"$f":"IF(H24=\"W\",1,0)+IF(K25=\"L\",1,0)+IF(N25=\"L\",1,0)","v":0},{"$f":"SUM(G24)+SUM(I25)+SUM(L25)","v":0},{"$f":"SUM(F24)+SUM(J25)+SUM(M25)","v":0},{"$f":"T25-U25","v":0},{"$f":"SUM(Q25*3)+SUM(R25)","v":0}]
[null,{"$f":"Fixtures!G24","v":"USA"},null,null,null,null,null,null,null,null,null,{"$f":"IF(Fixtures!$J$24=\"\",\"\",Fixtures!$J$24)","v":""},{"$f":"IF(Fixtures!$K$24=\"\",\"\",Fixtures!$K$24)","v":""},{"$f":"IF(L26=\"\",\"\",IF(M26=\"\",\"\",IF(L26>M26,\"W\",IF(L26=M26,\"D\",IF(L26<M26,\"L\",\"\")))))","v":""},null,{"$f":"SUM(Q26)+SUM(R26)+SUM(S26)","v":0},{"$f":"IF(K24=\"L\",1,0)+IF(K25=\"L\",1,0)+IF(N26=\"W\",1,0)","v":0},{"$f":"IF(K24=\"D\",1,0)+IF(K25=\"D\",1,0)+IF(N26=\"D\",1,0)","v":0},{"$f":"IF(K24=\"W\",1,0)+IF(K25=\"W\",1,0)+IF(N26=\"L\",1,0)","v":0},{"$f":"SUM(J24)+SUM(J25)+SUM(L26)","v":0},{"$f":"SUM(I24)+SUM(I25)+SUM(M26)","v":0},{"$f":"T26-U26","v":0},{"$f":"SUM(Q26*3)+SUM(R26)","v":0}]
[null,{"$f":"Fixtures!I24","v":"Paraguay"},null,null,null,null,null,null,null,null,null,null,null,null,null,{"$f":"SUM(Q27)+SUM(R27)+SUM(S27)","v":0},{"$f":"IF(N24=\"L\",1,0)+IF(N25=\"L\",1,0)+IF(N26=\"L\",1,0)","v":0},{"$f":"IF(N24=\"D\",1,0)+IF(N25=\"D\",1,0)+IF(N26=\"D\",1,0)","v":0},{"$f":"IF(N24=\"W\",1,0)+IF(H27=\"W\",1,0)+IF(N26=\"W\",1,0)","v":0},{"$f":"SUM(M24)+SUM(M25)+SUM(M26)","v":0},{"$f":"SUM(L24)+SUM(L25)+SUM(L26)","v":0},{"$f":"T27-U27","v":0},{"$f":"SUM(Q27*3)+SUM(R27)","v":0}]
[null,null,null,null,null,null,null,null,null,null,null,null,null,null,null,{"$f":"IF(SUM(P24:P27)=12,\"Final Table\",\"Incomplete\")","v":"Incomplete"}]
[]
["E",{"$f":"P35","v":"Incomplete"},null,{"$f":"B31","v":"Côte d'Ivoire"},null,null,{"$f":"B32","v":"Germany"},null,null,{"$f":"B33","v":"Ecuador"},null,null,{"$f":"B34","v":"Curaçao"},null,null,"P","W","D","L","F","A","GD","Pts"]
[null,{"$f":"Fixtures!G32","v":"Côte d'Ivoire"},null,null,null,{"$f":"IF(Fixtures!$K$33=\"\",\"\",Fixtures!$K$33)","v":""},{"$f":"IF(Fixtures!$J$33=\"\",\"\",Fixtures!$J$33)","v":""},{"$f":"IF(F31=\"\",\"\",IF(G31=\"\",\"\",IF(F31>G31,\"W\",IF(F31=G31,\"D\",IF(F31<G31,\"L\",\"\")))))","v":""},{"$f":"IF(Fixtures!$J$32=\"\",\"\",Fixtures!$J$32)","v":""},{"$f":"IF(Fixtures!$K$32=\"\",\"\",Fixtures!$K$32)","v":""},{"$f":"IF(I31=\"\",\"\",IF(J31=\"\",\"\",IF(I31>J31,\"W\",IF(I31=J31,\"D\",IF(I31<J31,\"L\",\"\")))))","v":""},{"$f":"IF(Fixtures!$K$35=\"\",\"\",Fixtures!$K$35)","v":""},{"$f":"IF(Fixtures!$J$35=\"\",\"\",Fixtures!$J$35)","v":""},{"$f":"IF(L31=\"\",\"\",IF(M31=\"\",\"\",IF(L31>M31,\"W\",IF(L31=M31,\"D\",IF(L31<M31,\"L\",\"\")))))","v":""},null,{"$f":"SUM(Q31)+SUM(R31)+SUM(S31)","v":0},{"$f":"IF(H31=\"W\",1,0)+IF(K31=\"W\",1,0)+IF(N31=\"W\",1,0)","v":0},{"$f":"IF(H31=\"D\",1,0)+IF(K31=\"D\",1,0)+IF(N31=\"D\",1,0)","v":0},{"$f":"IF(H31=\"L\",1,0)+IF(K31=\"L\",1,0)+IF(N31=\"L\",1,0)","v":0},{"$f":"SUM(F31)+SUM(I31)+SUM(L31)","v":0},{"$f":"SUM(G31)+SUM(J31)+SUM(M31)","v":0},{"$f":"T31-U31","v":0},{"$f":"SUM(Q31*3)+SUM(R31)","v":0}]
[null,{"$f":"Fixtures!G31","v":"Germany"},null,null,null,null,null,null,{"$f":"IF(Fixtures!$K$36=\"\",\"\",Fixtures!$K$36)","v":""},{"$f":"IF(Fixtures!$J$36=\"\",\"\",Fixtures!$J$36)","v":""},{"$f":"IF(I32=\"\",\"\",IF(J32=\"\",\"\",IF(I32>J32,\"W\",IF(I32=J32,\"D\",IF(I32<J32,\"L\",\"\")))))","v":""},{"$f":"IF(Fixtures!$J$31=\"\",\"\",Fixtures!$J$31)","v":""},{"$f":"IF(Fixtures!$K$31=\"\",\"\",Fixtures!$K$31)","v":""},{"$f":"IF(L32=\"\",\"\",IF(M32=\"\",\"\",IF(L32>M32,\"W\",IF(L32=M32,\"D\",IF(L32<M32,\"L\",\"\")))))","v":""},null,{"$f":"SUM(Q32)+SUM(R32)+SUM(S32)","v":0},{"$f":"IF(H31=\"L\",1,0)+IF(K32=\"W\",1,0)+IF(N32=\"W\",1,0)","v":0},{"$f":"IF(H31=\"D\",1,0)+IF(K32=\"D\",1,0)+IF(N32=\"D\",1,0)","v":0},{"$f":"IF(H31=\"W\",1,0)+IF(K32=\"L\",1,0)+IF(N32=\"L\",1,0)","v":0},{"$f":"SUM(G31)+SUM(I32)+SUM(L32)","v":0},{"$f":"SUM(F31)+SUM(J32)+SUM(M32)","v":0},{"$f":"T32-U32","v":0},{"$f":"SUM(Q32*3)+SUM(R32)","v":0}]
[null,{"$f":"Fixtures!I32","v":"Ecuador"},null,null,null,null,null,null,null,null,null,{"$f":"IF(Fixtures!$J$34=\"\",\"\",Fixtures!$J$34)","v":""},{"$f":"IF(Fixtures!$K$34=\"\",\"\",Fixtures!$K$34)","v":""},{"$f":"IF(L33=\"\",\"\",IF(M33=\"\",\"\",IF(L33>M33,\"W\",IF(L33=M33,\"D\",IF(L33<M33,\"L\",\"\")))))","v":""},null,{"$f":"SUM(Q33)+SUM(R33)+SUM(S33)","v":0},{"$f":"IF(K31=\"L\",1,0)+IF(K32=\"L\",1,0)+IF(N33=\"W\",1,0)","v":0},{"$f":"IF(K31=\"D\",1,0)+IF(K32=\"D\",1,0)+IF(N33=\"D\",1,0)","v":0},{"$f":"IF(K31=\"W\",1,0)+IF(K32=\"W\",1,0)+IF(N33=\"L\",1,0)","v":0},{"$f":"SUM(J31)+SUM(J32)+SUM(L33)","v":0},{"$f":"SUM(I31)+SUM(I32)+SUM(M33)","v":0},{"$f":"T33-U33","v":0},{"$f":"SUM(Q33*3)+SUM(R33)","v":0}]
[null,{"$f":"Fixtures!I31","v":"Curaçao"},null,null,null,null,null,null,null,null,null,null,null,null,null,{"$f":"SUM(Q34)+SUM(R34)+SUM(S34)","v":0},{"$f":"IF(N31=\"L\",1,0)+IF(N32=\"L\",1,0)+IF(N33=\"L\",1,0)","v":0},{"$f":"IF(N31=\"D\",1,0)+IF(N32=\"D\",1,0)+IF(N33=\"D\",1,0)","v":0},{"$f":"IF(N31=\"W\",1,0)+IF(N32=\"W\",1,0)+IF(N33=\"W\",1,0)","v":0},{"$f":"SUM(M31)+SUM(M32)+SUM(M33)","v":0},{"$f":"SUM(L31)+SUM(L32)+SUM(L33)","v":0},{"$f":"T34-U34","v":0},{"$f":"SUM(Q34*3)+SUM(R34)","v":0}]
[null,null,null,null,null,null,null,null,null,null,null,null,null,null,null,{"$f":"IF(SUM(P31:P34)=12,\"Final Table\",\"Incomplete\")","v":"Incomplete"}]
[]
["F",{"$f":"P42","v":"Incomplete"},null,{"$f":"B38","v":"(UKR,SWE,POL,ALB)"},null,null,{"$f":"B39","v":"Netherlands"},null,null,{"$f":"B40","v":"Tunisia"},null,null,{"$f":"B41","v":"Japan"},null,null,"P","W","D","L","F","A","GD","Pts"]
[null,{"$f":"Fixtures!G39","v":"(UKR,SWE,POL,ALB)"},null,null,null,null,null,null,{"$f":"IF(Fixtures!$J$39=\"\",\"\",Fixtures!$J$39)","v":""},{"$f":"IF(Fixtures!$K$39=\"\",\"\",Fixtures!$K$39)","v":""},{"$f":"IF(I38=\"\",\"\",IF(J38=\"\",\"\",IF(I38>J38,\"W\",IF(I38=J38,\"D\",IF(I38<J38,\"L\",\"\")))))","v":""},{"$f":"IF(Fixtures!$K$42=\"\",\"\",Fixtures!$K$42)","v":""},{"$f":"IF(Fixtures!$J$42=\"\",\"\",Fixtures!$J$42)","v":""},{"$f":"IF(L38=\"\",\"\",IF(M38=\"\",\"\",IF(L38>M38,\"W\",IF(L38=M38,\"D\",IF(L38<M38,\"L\",\"\")))))","v":""},null,{"$f":"SUM(Q38)+SUM(R38)+SUM(S38)","v":0},{"$f":"IF(E39=\"L\",1,0)+IF(K38=\"W\",1,0)+IF(N38=\"W\",1,0)","v":0},{"$f":"IF(E39=\"D\",1,0)+IF(K38=\"D\",1,0)+IF(N38=\"D\",1,0)","v":0},{"$f":"IF(E39=\"W\",1,0)+IF(K38=\"L\",1,0)+IF(N38=\"L\",1,0)","v":0},{"$f":"SUM(D39)+SUM(I38)+SUM(L38)","v":0},{"$f":"SUM(C39)+SUM(J38)+SUM(M38)","v":0},{"$f":"T38-U38","v":0},{"$f":"SUM(Q38*3)+SUM(R38)","v":0}]
[null,{"$f":"Fixtures!G38","v":"Netherlands"},{"$f":"IF(Fixtures!$J$40=\"\",\"\",Fixtures!$J$40)","v":""},{"$f":"IF(Fixtures!$K$40=\"\",\"\",Fixtures!$K$40)","v":""},{"$f":"IF(C39=\"\",\"\",IF(D39=\"\",\"\",IF(C39>D39,\"W\",IF(C39=D39,\"D\",IF(C39<D39,\"L\",\"\")))))","v":""},null,null,null,{"$f":"IF(Fixtures!$K$43=\"\",\"\",Fixtures!$K$43)","v":""},{"$f":"IF(Fixtures!$J$43=\"\",\"\",Fixtures!$J$43)","v":""},{"$f":"IF(I39=\"\",\"\",IF(J39=\"\",\"\",IF(I39>J39,\"W\",IF(I39=J39,\"D\",IF(I39<J39,\"L\",\"\")))))","v":""},{"$f":"IF(Fixtures!$J$38=\"\",\"\",Fixtures!$J$38)","v":""},{"$f":"IF(Fixtures!$K$38=\"\",\"\",Fixtures!$K$38)","v":""},{"$f":"IF(L39=\"\",\"\",IF(M39=\"\",\"\",IF(L39>M39,\"W\",IF(L39=M39,\"D\",IF(L39<M39,\"L\",\"\")))))","v":""},null,{"$f":"SUM(Q39)+SUM(R39)+SUM(S39)","v":0},{"$f":"IF(E39=\"W\",1,0)+IF(K39=\"W\",1,0)+IF(N39=\"W\",1,0)","v":0},{"$f":"IF(E39=\"D\",1,0)+IF(K39=\"D\",1,0)+IF(N39=\"D\",1,0)","v":0},{"$f":"IF(E39=\"L\",1,0)+IF(K39=\"L\",1,0)+IF(N39=\"L\",1,0)","v":0},{"$f":"SUM(C39)+SUM(I39)+SUM(L39)","v":0},{"$f":"SUM(D39)+SUM(J39)+SUM(M39)","v":0},{"$f":"T39-U39","v":0},{"$f":"SUM(Q39*3)+SUM(R39)","v":0}]
[null,{"$f":"Fixtures!I39","v":"Tunisia"},null,null,null,null,null,null,null,null,null,{"$f":"IF(Fixtures!$J$41=\"\",\"\",Fixtures!$J$41)","v":""},{"$f":"IF(Fixtures!$K$41=\"\",\"\",Fixtures!$K$41)","v":""},{"$f":"IF(L40=\"\",\"\",IF(M40=\"\",\"\",IF(L40>M40,\"W\",IF(L40=M40,\"D\",IF(L40<M40,\"L\",\"\")))))","v":""},null,{"$f":"SUM(Q40)+SUM(R40)+SUM(S40)","v":0},{"$f":"IF(K38=\"L\",1,0)+IF(K39=\"L\",1,0)+IF(N40=\"W\",1,0)","v":0},{"$f":"IF(K38=\"D\",1,0)+IF(K39=\"D\",1,0)+IF(N40=\"D\",1,0)","v":0},{"$f":"IF(K38=\"W\",1,0)+IF(K39=\"W\",1,0)+IF(N40=\"L\",1,0)","v":0},{"$f":"SUM(J38)+SUM(J39)+SUM(L40)","v":0},{"$f":"SUM(I38)+SUM(I39)+SUM(M40)","v":0},{"$f":"T40-U40","v":0},{"$f":"SUM(Q40*3)+SUM(R40)","v":0}]
[null,{"$f":"Fixtures!I38","v":"Japan"},null,null,null,null,null,null,null,null,null,null,null,null,null,{"$f":"SUM(Q41)+SUM(R41)+SUM(S41)","v":0},{"$f":"IF(N38=\"L\",1,0)+IF(N39=\"L\",1,0)+IF(N40=\"L\",1,0)","v":0},{"$f":"IF(N38=\"D\",1,0)+IF(N39=\"D\",1,0)+IF(N40=\"D\",1,0)","v":0},{"$f":"IF(N38=\"W\",1,0)+IF(N39=\"W\",1,0)+IF(N40=\"W\",1,0)","v":0},{"$f":"SUM(M38)+SUM(M39)+SUM(M40)","v":0},{"$f":"SUM(L38)+SUM(L39)+SUM(L40)","v":0},{"$f":"T41-U41","v":0},{"$f":"SUM(Q41*3)+SUM(R41)","v":0}]
[null,null,null,null,null,null,null,null,null,null,null,null,null,null,null,{"$f":"IF(SUM(P38:P41)=12,\"Final Table\",\"Incomplete\")","v":"Incomplete"}]
[]
["G",{"$f":"P49","v":"Incomplete"},null,{"$f":"B45","v":"Iran"},null,null,{"$f":"B46","v":"Belgium"},null,null,{"$f":"B47","v":"NewZealand"},null,null,{"$f":"B48","v":"Egypt"},null,null,"P","W","D","L","F","A","GD","Pts"]
[null,{"$f":"Fixtures!G46","v":"Iran"},null,null,null,null,null,null,{"$f":"IF(Fixtures!$J$46=\"\",\"\",Fixtures!$J$46)","v":""},{"$f":"IF(Fixtures!$K$46=\"\",\"\",Fixtures!$K$46)","v":""},{"$f":"IF(I45=\"\",\"\",IF(J45=\"\",\"\",IF(I45>J45,\"W\",IF(I45=J45,\"D\",IF(I45<J45,\"L\",\"\")))))","v":""},{"$f":"IF(Fixtures!$K$49=\"\",\"\",Fixtures!$K$49)","v":""},{"$f":"IF(Fixtures!$J$49=\"\",\"\",Fixtures!$J$49)","v":""},{"$f":"IF(L45=\"\",\"\",IF(M45=\"\",\"\",IF(L45>M45,\"W\",IF(L45=M45,\"D\",IF(L45<M45,\"L\",\"\")))))","v":""},null,{"$f":"SUM(Q45)+SUM(R45)+SUM(S45)","v":0},{"$f":"IF(E46=\"L\",1,0)+IF(K45=\"W\",1,0)+IF(N45=\"W\",1,0)","v":0},{"$f":"IF(E46=\"D\",1,0)+IF(K45=\"D\",1,0)+IF(N45=\"D\",1,0)","v":0},{"$f":"IF(E46=\"W\",1,0)+IF(K45=\"L\",1,0)+IF(N45=\"L\",1,0)","v":0},{"$f":"SUM(D46)+SUM(I45)+SUM(L45)","v":0},{"$f":"SUM(C46)+SUM(J45)+SUM(M45)","v":0},{"$f":"T45-U45","v":0},{"$f":"SUM(Q45*3)+SUM(R45)","v":0}]
[null,{"$f":"Fixtures!G45","v":"Belgium"},{"$f":"IF(Fixtures!$J$47=\"\",\"\",Fixtures!$J$47)","v":""},{"$f":"IF(Fixtures!$K$47=\"\",\"\",Fixtures!$K$47)","v":""},{"$f":"IF(C46=\"\",\"\",IF(D46=\"\",\"\",IF(C46>D46,\"W\",IF(C46=D46,\"D\",IF(C46<D46,\"L\",\"\")))))","v":""},null,null,null,{"$f":"IF(Fixtures!$K$50=\"\",\"\",Fixtures!$K$50)","v":""},{"$f":"IF(Fixtures!$J$50=\"\",\"\",Fixtures!$J$50)","v":""},{"$f":"IF(I46=\"\",\"\",IF(J46=\"\",\"\",IF(I46>J46,\"W\",IF(I46=J46,\"D\",IF(I46<J46,\"L\",\"\")))))","v":""},{"$f":"IF(Fixtures!$J$45=\"\",\"\",Fixtures!$J$45)","v":""},{"$f":"IF(Fixtures!$K$45=\"\",\"\",Fixtures!$K$45)","v":""},{"$f":"IF(L46=\"\",\"\",IF(M46=\"\",\"\",IF(L46>M46,\"W\",IF(L46=M46,\"D\",IF(L46<M46,\"L\",\"\")))))","v":""},null,{"$f":"SUM(Q46)+SUM(R46)+SUM(S46)","v":0},{"$f":"IF(E46=\"W\",1,0)+IF(K46=\"W\",1,0)+IF(N46=\"W\",1,0)","v":0},{"$f":"IF(E46=\"D\",1,0)+IF(K46=\"D\",1,0)+IF(N46=\"D\",1,0)","v":0},{"$f":"IF(E46=\"L\",1,0)+IF(K46=\"L\",1,0)+IF(N46=\"L\",1,0)","v":0},{"$f":"SUM(C46)+SUM(I46)+SUM(L46)","v":0},{"$f":"SUM(D46)+SUM(J46)+SUM(M46)","v":0},{"$f":"T46-U46","v":0},{"$f":"SUM(Q46*3)+SUM(R46)","v":0}]
[null,{"$f":"Fixtures!I46","v":"NewZealand"},null,null,null,null,null,null,null,null,null,{"$f":"IF(Fixtures!$J$48=\"\",\"\",Fixtures!$J$48)","v":""},{"$f":"IF(Fixtures!$K$48=\"\",\"\",Fixtures!$K$48)","v":""},{"$f":"IF(L47=\"\",\"\",IF(M47=\"\",\"\",IF(L47>M47,\"W\",IF(L47=M47,\"D\",IF(L47<M47,\"L\",\"\")))))","v":""},null,{"$f":"SUM(Q47)+SUM(R47)+SUM(S47)","v":0},{"$f":"IF(K45=\"L\",1,0)+IF(K46=\"L\",1,0)+IF(N47=\"W\",1,0)","v":0},{"$f":"IF(K45=\"D\",1,0)+IF(K46=\"D\",1,0)+IF(N47=\"D\",1,0)","v":0},{"$f":"IF(K45=\"W\",1,0)+IF(K46=\"W\",1,0)+IF(N47=\"L\",1,0)","v":0},{"$f":"SUM(J45)+SUM(J46)+SUM(L47)","v":0},{"$f":"SUM(I45)+SUM(I46)+SUM(M47)","v":0},{"$f":"T47-U47","v":0},{"$f":"SUM(Q47*3)+SUM(R47)","v":0}]
[null,{"$f":"Fixtures!I45","v":"Egypt"},null,null,null,null,null,null,null,null,null,null,null,null,null,{"$f":"SUM(Q48)+SUM(R48)+SUM(S48)","v":0},{"$f":"IF(N45=\"L\",1,0)+IF(N46=\"L\",1,0)+IF(N47=\"L\",1,0)","v":0},{"$f":"IF(N45=\"D\",1,0)+IF(N46=\"D\",1,0)+IF(N47=\"D\",1,0)","v":0},{"$f":"IF(N45=\"W\",1,0)+IF(N46=\"W\",1,0)+IF(N47=\"W\",1,0)","v":0},{"$f":"SUM(M45)+SUM(M46)+SUM(M47)","v":0},{"$f":"SUM(L45)+SUM(L46)+SUM(L47)","v":0},{"$f":"T48-U48","v":0},{"$f":"SUM(Q48*3)+SUM(R48)","v":0}]
[null,null,null,null,null,null,null,null,null,null,null,null,null,null,null,{"$f":"IF(SUM(P45:P48)=12,\"Final Table\",\"Incomplete\")","v":"Incomplete"}]
[]
["H",{"$f":"P56","v":"Incomplete"},null,{"$f":"B52","v":"Saudi Arabia"},null,null,{"$f":"B53","v":"Uruguay"},null,null,{"$f":"B54","v":"Spain"},null,null,{"$f":"B55","v":"Cape Verde"},null,null,"P","W","D","L","F","A","GD","Pts"]
[null,{"$f":"Fixtures!G53","v":"Saudi Arabia"},null,null,null,{"$f":"IF(Fixtures!$J$53=\"\",\"\",Fixtures!$J$53)","v":""},{"$f":"IF(Fixtures!$K$53=\"\",\"\",Fixtures!$K$53)","v":""},{"$f":"IF(F52=\"\",\"\",IF(G52=\"\",\"\",IF(F52>G52,\"W\",IF(F52=G52,\"D\",IF(F52<G52,\"L\",\"\")))))","v":""},{"$f":"IF(Fixtures!$K$54=\"\",\"\",Fixtures!$K$54)","v":""},{"$f":"IF(Fixtures!$J$54=\"\",\"\",Fixtures!$J$54)","v":""},{"$f":"IF(I52=\"\",\"\",IF(J52=\"\",\"\",IF(I52>J52,\"W\",IF(I52=J52,\"D\",IF(I52<J52,\"L\",\"\")))))","v":""},{"$f":"IF(Fixtures!$K$57=\"\",\"\",Fixtures!$K$57)","v":""},{"$f":"IF(Fixtures!$J$57=\"\",\"\",Fixtures!$J$57)","v":""},{"$f":"IF(L52=\"\",\"\",IF(M52=\"\",\"\",IF(L52>M52,\"W\",IF(L52=M52,\"D\",IF(L52<M52,\"L\",\"\")))))","v":""},null,{"$f":"SUM(Q52)+SUM(R52)+SUM(S52)","v":0},{"$f":"IF(H52=\"W\",1,0)+IF(K52=\"W\",1,0)+IF(N52=\"W\",1,0)","v":0},{"$f":"IF(H52=\"D\",1,0)+IF(K52=\"D\",1,0)+IF(N52=\"D\",1,0)","v":0},{"$f":"IF(H52=\"L\",1,0)+IF(K52=\"L\",1,0)+IF(N52=\"L\",1,0)","v":0},{"$f":"SUM(F52)+SUM(I52)+SUM(L52)","v":0},{"$f":"SUM(G52)+SUM(J52)+SUM(M52)","v":0},{"$f":"T52-U52","v":0},{"$f":"SUM(Q52*3)+SUM(R52)","v":0}]
[null,{"$f":"Fixtures!I53","v":"Uruguay"},null,null,null,null,null,null,{"$f":"IF(Fixtures!$J$56=\"\",\"\",Fixtures!$J$56)","v":""},{"$f":"IF(Fixtures!$K$56=\"\",\"\",Fixtures!$K$56)","v":""},{"$f":"IF(I53=\"\",\"\",IF(J53=\"\",\"\",IF(I53>J53,\"W\",IF(I53=J53,\"D\",IF(I53<J53,\"L\",\"\")))))","v":""},{"$f":"IF(Fixtures!$J$55=\"\",\"\",Fixtures!$J$55)","v":""},{"$f":"IF(Fixtures!$K$55=\"\",\"\",Fixtures!$K$55)","v":""},{"$f":"IF(L53=\"\",\"\",IF(M53=\"\",\"\",IF(L53>M53,\"W\",IF(L53=M53,\"D\",IF(L53<M53,\"L\",\"\")))))","v":""},null,{"$f":"SUM(Q53)+SUM(R53)+SUM(S53)","v":0},{"$f":"IF(H52=\"L\",1,0)+IF(K53=\"W\",1,0)+IF(N53=\"W\",1,0)","v":0},{"$f":"IF(H52=\"D\",1,0)+IF(K53=\"D\",1,0)+IF(N53=\"D\",1,0)","v":0},{"$f":"IF(H52=\"W\",1,0)+IF(K53=\"L\",1,0)+IF(N53=\"L\",1,0)","v":0},{"$f":"SUM(G52)+SUM(I53)+SUM(L53)","v":0},{"$f":"SUM(F52)+SUM(J53)+SUM(M53)","v":0},{"$f":"T53-U53","v":0},{"$f":"SUM(Q53*3)+SUM(R53)","v":0}]
[null,{"$f":"Fixtures!G52","v":"Spain"},null,null,null,null,null,null,null,null,null,{"$f":"IF(Fixtures!$J$52=\"\",\"\",Fixtures!$J$52)","v":""},{"$f":"IF(Fixtures!$K$52=\"\",\"\",Fixtures!$K$52)","v":""},{"$f":"IF(L54=\"\",\"\",IF(M54=\"\",\"\",IF(L54>M54,\"W\",IF(L54=M54,\"D\",IF(L54<M54,\"L\",\"\")))))","v":""},null,{"$f":"SUM(Q54)+SUM(R54)+SUM(S54)","v":0},{"$f":"IF(K52=\"L\",1,0)+IF(K53=\"L\",1,0)+IF(N54=\"W\",1,0)","v":0},{"$f":"IF(K52=\"D\",1,0)+IF(K53=\"D\",1,0)+IF(N54=\"D\",1,0)","v":0},{"$f":"IF(K52=\"W\",1,0)+IF(K53=\"W\",1,0)+IF(N54=\"L\",1,0)","v":0},{"$f":"SUM(J52)+SUM(J53)+SUM(L54)","v":0},{"$f":"SUM(I52)+SUM(I53)+SUM(M54)","v":0},{"$f":"T54-U54","v":0},{"$f":"SUM(Q54*3)+SUM(R54)","v":0}]
[null,{"$f":"Fixtures!I52","v":"Cape Verde"},null,null,null,null,null,null,null,null,null,null,null,null,null,{"$f":"SUM(Q55)+SUM(R55)+SUM(S55)","v":0},{"$f":"IF(N52=\"L\",1,0)+IF(N53=\"L\",1,0)+IF(N54=\"L\",1,0)","v":0},{"$f":"IF(N52=\"D\",1,0)+IF(N53=\"D\",1,0)+IF(N54=\"D\",1,0)","v":0},{"$f":"IF(N52=\"W\",1,0)+IF(N53=\"W\",1,0)+IF(N54=\"W\",1,0)","v":0},{"$f":"SUM(M52)+SUM(M53)+SUM(M54)","v":0},{"$f":"SUM(L52)+SUM(L53)+SUM(L54)","v":0},{"$f":"T55-U55","v":0},{"$f":"SUM(Q55*3)+SUM(R55)","v":0}]
[null,null,null,null,null,null,null,null,null,null,null,null,null,null,null,{"$f":"IF(SUM(P52:P55)=12,\"Final Table\",\"Incomplete\")","v":"Incomplete"}]
[]
["I",{"$f":"P63","v":"Incomplete"},null,{"$f":"B59","v":"(BOL,SUR,IRQ)"},null,null,{"$f":"B60","v":"France"},null,null,{"$f":"B61","v":"Norway"},null,null,{"$f":"B62","v":"Senegal"},null,null,"P","W","D","L","F","A","GD","Pts"]
[null,{"$f":"Fixtures!G60","v":"(BOL,SUR,IRQ)"},null,null,null,null,null,null,{"$f":"IF(Fixtures!$J$60=\"\",\"\",Fixtures!$J$60)","v":""},{"$f":"IF(Fixtures!$K$60=\"\",\"\",Fixtures!$K$60)","v":""},{"$f":"IF(I59=\"\",\"\",IF(J59=\"\",\"\",IF(I59>J59,\"W\",IF(I59=J59,\"D\",IF(I59<J59,\"L\",\"\")))))","v":""},{"$f":"IF(Fixtures!$K$64=\"\",\"\",Fixtures!$K$64)","v":""},{"$f":"IF(Fixtures!$J$64=\"\",\"\",Fixtures!$J$64)","v":""},{"$f":"IF(L59=\"\",\"\",IF(M59=\"\",\"\",IF(L59>M59,\"W\",IF(L59=M59,\"D\",IF(L59<M59,\"L\",\"\")))))","v":""},null,{"$f":"SUM(Q59)+SUM(R59)+SUM(S59)","v":0},{"$f":"IF(E60=\"L\",1,0)+IF(K59=\"W\",1,0)+IF(N59=\"W\",1,0)","v":0},{"$f":"IF(E60=\"D\",1,0)+IF(K59=\"D\",1,0)+IF(N59=\"D\",1,0)","v":0},{"$f":"IF(E60=\"W\",1,0)+IF(K59=\"L\",1,0)+IF(N59=\"L\",1,0)","v":0},{"$f":"SUM(D60)+SUM(I59)+SUM(L59)","v":0},{"$f":"SUM(C60)+SUM(J59)+SUM(M59)","v":0},{"$f":"T59-U59","v":0},{"$f":"SUM(Q59*3)+SUM(R59)","v":0}]
[null,{"$f":"Fixtures!G59","v":"France"},{"$f":"IF(Fixtures!$J$61=\"\",\"\",Fixtures!$J$61)","v":""},{"$f":"IF(Fixtures!$K$61=\"\",\"\",Fixtures!$K$61)","v":""},{"$f":"IF(C60=\"\",\"\",IF(D60=\"\",\"\",IF(C60>D60,\"W\",IF(C60=D60,\"D\",IF(C60<D60,\"L\",\"\")))))","v":""},null,null,null,{"$f":"IF(Fixtures!$K$63=\"\",\"\",Fixtures!$K$63)","v":""},{"$f":"IF(Fixtures!$J$63=\"\",\"\",Fixtures!$J$63)","v":""},{"$f":"IF(I60=\"\",\"\",IF(J60=\"\",\"\",IF(I60>J60,\"W\",IF(I60=J60,\"D\",IF(I60<J60,\"L\",\"\")))))","v":""},{"$f":"IF(Fixtures!$J$59=\"\",\"\",Fixtures!$J$59)","v":""},{"$f":"IF(Fixtures!$K$59=\"\",\"\",Fixtures!$K$59)","v":""},{"$f":"IF(L60=\"\",\"\",IF(M60=\"\",\"\",IF(L60>M60,\"W\",IF(L60=M60,\"D\",IF(L60<M60,\"L\",\"\")))))","v":""},null,{"$f":"SUM(Q60)+SUM(R60)+SUM(S60)","v":0},{"$f":"IF(E60=\"W\",1,0)+IF(K60=\"W\",1,0)+IF(N60=\"W\",1,0)","v":0},{"$f":"IF(E60=\"D\",1,0)+IF(K60=\"D\",1,0)+IF(N60=\"D\",1,0)","v":0},{"$f":"IF(E60=\"L\",1,0)+IF(K60=\"L\",1,0)+IF(N60=\"L\",1,0)","v":0},{"$f":"SUM(C60)+SUM(I60)+SUM(L60)","v":0},{"$f":"SUM(D60)+SUM(J60)+SUM(M60)","v":0},{"$f":"T60-U60","v":0},{"$f":"SUM(Q60*3)+SUM(R60)","v":0}]
[null,{"$f":"Fixtures!I60","v":"Norway"},null,null,null,null,null,null,null,null,null,{"$f":"IF(Fixtures!$J$62=\"\",\"\",Fixtures!$J$62)","v":""},{"$f":"IF(Fixtures!$K$62=\"\",\"\",Fixtures!$K$62)","v":""},{"$f":"IF(L61=\"\",\"\",IF(M61=\"\",\"\",IF(L61>M61,\"W\",IF(L61=M61,\"D\",IF(L61<M61,\"L\",\"\")))))","v":""},null,{"$f":"SUM(Q61)+SUM(R61)+SUM(S61)","v":0},{"$f":"IF(K59=\"L\",1,0)+IF(K60=\"L\",1,0)+IF(N61=\"W\",1,0)","v":0},{"$f":"IF(K59=\"D\",1,0)+IF(K60=\"D\",1,0)+IF(N61=\"D\",1,0)","v":0},{"$f":"IF(K59=\"W\",1,0)+IF(K60=\"W\",1,0)+IF(N61=\"L\",1,0)","v":0},{"$f":"SUM(J59)+SUM(J60)+SUM(L61)","v":0},{"$f":"SUM(I59)+SUM(I60)+SUM(M61)","v":0},{"$f":"T61-U61","v":0},{"$f":"SUM(Q61*3)+SUM(R61)","v":0}]
[null,{"$f":"Fixtures!I59","v":"Senegal"},null,null,null,null,null,null,null,null,null,null,null,null,null,{"$f":"SUM(Q62)+SUM(R62)+SUM(S62)","v":0},{"$f":"IF(N59=\"L\",1,0)+IF(N60=\"L\",1,0)+IF(N61=\"L\",1,0)","v":0},{"$f":"IF(N59=\"D\",1,0)+IF(N60=\"D\",1,0)+IF(N61=\"D\",1,0)","v":0},{"$f":"IF(N59=\"W\",1,0)+IF(N60=\"W\",1,0)+IF(N61=\"W\",1,0)","v":0},{"$f":"SUM(M59)+SUM(M60)+SUM(M61)","v":0},{"$f":"SUM(L59)+SUM(L60)+SUM(L61)","v":0},{"$f":"T62-U62","v":0},{"$f":"SUM(Q62*3)+SUM(R62)","v":0}]
[null,null,null,null,null,null,null,null,null,null,null,null,null,null,null,{"$f":"IF(SUM(P59:P62)=12,\"Final Table\",\"Incomplete\")","v":"Incomplete"}]
[]
["J",{"$f":"P70","v":"Incomplete"},null,{"$f":"B66","v":"Austria"},null,null,{"$f":"B67","v":"Jordan"},null,null,{"$f":"B68","v":"Argentina"},null,null,{"$f":"B69","v":"Algeria"},null,null,"P","W","D","L","F","A","GD","Pts"]
[null,{"$f":"Fixtures!G67","v":"Austria"},null,null,null,{"$f":"IF(Fixtures!$J$67=\"\",\"\",Fixtures!$J$67)","v":""},{"$f":"IF(Fixtures!$K$67=\"\",\"\",Fixtures!$K$67)","v":""},{"$f":"IF(F66=\"\",\"\",IF(G66=\"\",\"\",IF(F66>G66,\"W\",IF(F66=G66,\"D\",IF(F66<G66,\"L\",\"\")))))","v":""},{"$f":"IF(Fixtures!$K$68=\"\",\"\",Fixtures!$K$68)","v":""},{"$f":"IF(Fixtures!$J$68=\"\",\"\",Fixtures!$J$68)","v":""},{"$f":"IF(I66=\"\",\"\",IF(J66=\"\",\"\",IF(I66>J66,\"W\",IF(I66=J66,\"D\",IF(I66<J66,\"L\",\"\")))))","v":""},null,null,null,null,{"$f":"SUM(Q66)+SUM(R66)+SUM(S66)","v":0},{"$f":"IF(H66=\"W\",1,0)+IF(E69=\"L\",1,0)+IF(K66=\"W\",1,0)","v":0},{"$f":"IF(H66=\"D\",1,0)+IF(E69=\"D\",1,0)+IF(K66=\"D\",1,0)","v":0},{"$f":"IF(H66=\"L\",1,0)+IF(E69=\"W\",1,0)+IF(K66=\"L\",1,0)","v":0},{"$f":"SUM(F66)+SUM(D69)+SUM(I66)","v":0},{"$f":"SUM(G66)+SUM(C69)+SUM(J66)","v":0},{"$f":"T66-U66","v":0},{"$f":"SUM(Q66*3)+SUM(R66)","v":0}]
[null,{"$f":"Fixtures!I67","v":"Jordan"},null,null,null,null,null,null,null,null,null,{"$f":"IF(Fixtures!$J$69=\"\",\"\",Fixtures!$J$69)","v":""},{"$f":"IF(Fixtures!$K$69=\"\",\"\",Fixtures!$K$69)","v":""},{"$f":"IF(L67=\"\",\"\",IF(M67=\"\",\"\",IF(L67>M67,\"W\",IF(L67=M67,\"D\",IF(L67<M67,\"L\",\"\")))))","v":""},null,{"$f":"SUM(Q67)+SUM(R67)+SUM(S67)","v":0},{"$f":"IF(H66=\"L\",1,0)+IF(N67=\"W\",1,0)+IF(H68=\"L\",1,0)","v":0},{"$f":"IF(H66=\"D\",1,0)+IF(N67=\"D\",1,0)+IF(H68=\"D\",1,0)","v":0},{"$f":"IF(H66=\"W\",1,0)+IF(N67=\"L\",1,0)+IF(H68=\"W\",1,0)","v":0},{"$f":"SUM(G66)+SUM(L67)+SUM(G68)","v":0},{"$f":"SUM(F66)+SUM(M67)+SUM(F68)","v":0},{"$f":"T67-U67","v":0},{"$f":"SUM(Q67*3)+SUM(R67)","v":0}]
[null,{"$f":"Fixtures!G66","v":"Argentina"},null,null,null,{"$f":"IF(Fixtures!$K$71=\"\",\"\",Fixtures!$K$71)","v":""},{"$f":"IF(Fixtures!$J$71=\"\",\"\",Fixtures!$J$71)","v":""},{"$f":"IF(F68=\"\",\"\",IF(G68=\"\",\"\",IF(F68>G68,\"W\",IF(F68=G68,\"D\",IF(F68<G68,\"L\",\"\")))))","v":""},null,null,null,{"$f":"IF(Fixtures!$J$66=\"\",\"\",Fixtures!$J$66)","v":""},{"$f":"IF(Fixtures!$K$66=\"\",\"\",Fixtures!$K$66)","v":""},{"$f":"IF(L68=\"\",\"\",IF(M68=\"\",\"\",IF(L68>M68,\"W\",IF(L68=M68,\"D\",IF(L68<M68,\"L\",\"\")))))","v":""},null,{"$f":"SUM(Q68)+SUM(R68)+SUM(S68)","v":0},{"$f":"IF(N68=\"W\",1,0)+IF(N67=\"L\",1,0)+IF(H68=\"W\",1,0)","v":0},{"$f":"IF(N68=\"D\",1,0)+IF(N67=\"D\",1,0)+IF(H68=\"D\",1,0)","v":0},{"$f":"IF(N68=\"L\",1,0)+IF(N67=\"W\",1,0)+IF(H68=\"L\",1,0)","v":0},{"$f":"SUM(F68)+SUM(M67)+SUM(L68)","v":0},{"$f":"SUM(G68)+SUM(L67)+SUM(M68)","v":0},{"$f":"T68-U68","v":0},{"$f":"SUM(Q68*3)+SUM(R68)","v":0}]
[null,{"$f":"Fixtures!I66","v":"Algeria"},{"$f":"IF(Fixtures!$J$70=\"\",\"\",Fixtures!$J$70)","v":""},{"$f":"IF(Fixtures!$K$70=\"\",\"\",Fixtures!$K$70)","v":""},{"$f":"IF(C69=\"\",\"\",IF(D69=\"\",\"\",IF(C69>D69,\"W\",IF(C69=D69,\"D\",IF(C69<D69,\"L\",\"\")))))","v":""},null,null,null,null,null,null,null,null,null,null,{"$f":"SUM(Q69)+SUM(R69)+SUM(S69)","v":0},{"$f":"IF(K66=\"L\",1,0)+IF(E69=\"W\",1,0)+IF(N68=\"L\",1,0)","v":0},{"$f":"IF(K66=\"D\",1,0)+IF(E69=\"D\",1,0)+IF(N68=\"D\",1,0)","v":0},{"$f":"IF(K66=\"W\",1,0)+IF(E69=\"L\",1,0)+IF(N68=\"W\",1,0)","v":0},{"$f":"SUM(J66)+SUM(C69)+SUM(M68)","v":0},{"$f":"SUM(I66)+SUM(D69)+SUM(L68)","v":0},{"$f":"T69-U69","v":0},{"$f":"SUM(Q69*3)+SUM(R69)","v":0}]
[null,null,null,null,null,null,null,null,null,null,null,null,null,null,null,{"$f":"IF(SUM(P66:P69)=12,\"Final Table\",\"Incomplete\")","v":"Incomplete"}]
[]
["K",{"$f":"P77","v":"Incomplete"},null,{"$f":"B73","v":"Uzbekistan"},null,null,{"$f":"B74","v":"Portugal"},null,null,{"$f":"B75","v":"Colombia"},null,null,{"$f":"B76","v":"(NCL,JAM,COD)"},null,null,"P","W","D","L","F","A","GD","Pts"]
[null,{"$f":"Fixtures!G74","v":"Uzbekistan"},null,null,null,null,null,null,{"$f":"IF(Fixtures!$J$74=\"\",\"\",Fixtures!$J$74)","v":""},{"$f":"IF(Fixtures!$K$74=\"\",\"\",Fixtures!$K$74)","v":""},{"$f":"IF(I73=\"\",\"\",IF(J73=\"\",\"\",IF(I73>J73,\"W\",IF(I73=J73,\"D\",IF(I73<J73,\"L\",\"\")))))","v":""},{"$f":"IF(Fixtures!$K$78=\"\",\"\",Fixtures!$K$78)","v":""},{"$f":"IF(Fixtures!$J$78=\"\",\"\",Fixtures!$J$78)","v":""},{"$f":"IF(L73=\"\",\"\",IF(M73=\"\",\"\",IF(L73>M73,\"W\",IF(L73=M73,\"D\",IF(L73<M73,\"L\",\"\")))))","v":""},null,{"$f":"SUM(Q73)+SUM(R73)+SUM(S73)","v":0},{"$f":"IF(E74=\"L\",1,0)+IF(K73=\"W\",1,0)+IF(N73=\"W\",1,0)","v":0},{"$f":"IF(E74=\"D\",1,0)+IF(K73=\"D\",1,0)+IF(N73=\"D\",1,0)","v":0},{"$f":"IF(E74=\"W\",1,0)+IF(K73=\"L\",1,0)+IF(N73=\"L\",1,0)","v":0},{"$f":"SUM(D74)+SUM(I73)+SUM(L73)","v":0},{"$f":"SUM(C74)+SUM(J73)+SUM(M73)","v":0},{"$f":"T73-U73","v":0},{"$f":"SUM(Q73*3)+SUM(R73)","v":0}]
[null,{"$f":"Fixtures!G73","v":"Portugal"},{"$f":"IF(Fixtures!$J$75=\"\",\"\",Fixtures!$J$75)","v":""},{"$f":"IF(Fixtures!$K$75=\"\",\"\",Fixtures!$K$75)","v":""},{"$f":"IF(C74=\"\",\"\",IF(D74=\"\",\"\",IF(C74>D74,\"W\",IF(C74=D74,\"D\",IF(C74<D74,\"L\",\"\")))))","v":""},null,null,null,{"$f":"IF(Fixtures!$K$77=\"\",\"\",Fixtures!$K$77)","v":""},{"$f":"IF(Fixtures!$J$77=\"\",\"\",Fixtures!$J$77)","v":""},{"$f":"IF(I74=\"\",\"\",IF(J74=\"\",\"\",IF(I74>J74,\"W\",IF(I74=J74,\"D\",IF(I74<J74,\"L\",\"\")))))","v":""},{"$f":"IF(Fixtures!$J$73=\"\",\"\",Fixtures!$J$73)","v":""},{"$f":"IF(Fixtures!$K$73=\"\",\"\",Fixtures!$K$73)","v":""},{"$f":"IF(L74=\"\",\"\",IF(M74=\"\",\"\",IF(L74>M74,\"W\",IF(L74=M74,\"D\",IF(L74<M74,\"L\",\"\")))))","v":""},null,{"$f":"SUM(Q74)+SUM(R74)+SUM(S74)","v":0},{"$f":"IF(E74=\"W\",1,0)+IF(K74=\"W\",1,0)+IF(N74=\"W\",1,0)","v":0},{"$f":"IF(E74=\"D\",1,0)+IF(K74=\"D\",1,0)+IF(N74=\"D\",1,0)","v":0},{"$f":"IF(E74=\"L\",1,0)+IF(K74=\"L\",1,0)+IF(N74=\"L\",1,0)","v":0},{"$f":"SUM(C74)+SUM(I74)+SUM(L74)","v":0},{"$f":"SUM(D74)+SUM(J74)+SUM(M74)","v":0},{"$f":"T74-U74","v":0},{"$f":"SUM(Q74*3)+SUM(R74)","v":0}]
[null,{"$f":"Fixtures!I74","v":"Colombia"},null,null,null,null,null,null,null,null,null,{"$f":"IF(Fixtures!$J$76=\"\",\"\",Fixtures!$J$76)","v":""},{"$f":"IF(Fixtures!$K$76=\"\",\"\",Fixtures!$K$76)","v":""},{"$f":"IF(L75=\"\",\"\",IF(M75=\"\",\"\",IF(L75>M75,\"W\",IF(L75=M75,\"D\",IF(L75<M75,\"L\",\"\")))))","v":""},null,{"$f":"SUM(Q75)+SUM(R75)+SUM(S75)","v":0},{"$f":"IF(K73=\"L\",1,0)+IF(K74=\"L\",1,0)+IF(N75=\"W\",1,0)","v":0},{"$f":"IF(K73=\"D\",1,0)+IF(K74=\"D\",1,0)+IF(N75=\"D\",1,0)","v":0},{"$f":"IF(K73=\"W\",1,0)+IF(K74=\"W\",1,0)+IF(N75=\"L\",1,0)","v":0},{"$f":"SUM(J73)+SUM(J74)+SUM(L75)","v":0},{"$f":"SUM(I73)+SUM(I74)+SUM(M75)","v":0},{"$f":"T75-U75","v":0},{"$f":"SUM(Q75*3)+SUM(R75)","v":0}]
[null,{"$f":"Fixtures!I73","v":"(NCL,JAM,COD)"},null,null,null,null,null,null,null,null,null,null,null,null,null,{"$f":"SUM(Q76)+SUM(R76)+SUM(S76)","v":0},{"$f":"IF(N73=\"L\",1,0)+IF(N74=\"L\",1,0)+IF(N75=\"L\",1,0)","v":0},{"$f":"IF(N73=\"D\",1,0)+IF(N74=\"D\",1,0)+IF(N75=\"D\",1,0)","v":0},{"$f":"IF(N73=\"W\",1,0)+IF(N74=\"W\",1,0)+IF(N75=\"W\",1,0)","v":0},{"$f":"SUM(M73)+SUM(M74)+SUM(M75)","v":0},{"$f":"SUM(L73)+SUM(L74)+SUM(L75)","v":0},{"$f":"T76-U76","v":0},{"$f":"SUM(Q76*3)+SUM(R76)","v":0}]
[null,null,null,null,null,null,null,null,null,null,null,null,null,null,null,{"$f":"IF(SUM(P73:P76)=12,\"Final Table\",\"Incomplete\")","v":"Incomplete"}]
[]
["L",{"$f":"P84","v":"Incomplete"},null,{"$f":"B80","v":"Ghana"},null,null,{"$f":"B81","v":"Panama"},null,null,{"$f":"B82","v":"England"},null,null,{"$f":"B83","v":"Croatia"},null,null,"P","W","D","L","F","A","GD","Pts"]
[null,{"$f":"Fixtures!G81","v":"Ghana"},null,null,null,{"$f":"IF(Fixtures!$J$81=\"\",\"\",Fixtures!$J$81)","v":""},{"$f":"IF(Fixtures!$K$81=\"\",\"\",Fixtures!$K$81)","v":""},{"$f":"IF(F80=\"\",\"\",IF(G80=\"\",\"\",IF(F80>G80,\"W\",IF(F80=G80,\"D\",IF(F80<G80,\"L\",\"\")))))","v":""},{"$f":"IF(Fixtures!$K$82=\"\",\"\",Fixtures!$K$82)","v":""},{"$f":"IF(Fixtures!$J$82=\"\",\"\",Fixtures!$J$82)","v":""},{"$f":"IF(I80=\"\",\"\",IF(J80=\"\",\"\",IF(I80>J80,\"W\",IF(I80=J80,\"D\",IF(I80<J80,\"L\",\"\")))))","v":""},{"$f":"IF(Fixtures!$K$85=\"\",\"\",Fixtures!$K$85)","v":""},{"$f":"IF(Fixtures!$J$85=\"\",\"\",Fixtures!$J$85)","v":""},{"$f":"IF(L80=\"\",\"\",IF(M80=\"\",\"\",IF(L80>M80,\"W\",IF(L80=M80,\"D\",IF(L80<M80,\"L\",\"\")))))","v":""},null,{"$f":"SUM(Q80)+SUM(R80)+SUM(S80)","v":0},{"$f":"IF(H80=\"W\",1,0)+IF(K80=\"W\",1,0)+IF(N80=\"W\",1,0)","v":0},{"$f":"IF(H80=\"D\",1,0)+IF(K80=\"D\",1,0)+IF(N80=\"D\",1,0)","v":0},{"$f":"IF(H80=\"L\",1,0)+IF(K80=\"L\",1,0)+IF(N80=\"L\",1,0)","v":0},{"$f":"SUM(F80)+SUM(I80)+SUM(L80)","v":0},{"$f":"SUM(G80)+SUM(J80)+SUM(M80)","v":0},{"$f":"T80-U80","v":0},{"$f":"SUM(Q80*3)+SUM(R80)","v":0}]
[null,{"$f":"Fixtures!I81","v":"Panama"},null,null,null,null,null,null,{"$f":"IF(Fixtures!$J$84=\"\",\"\",Fixtures!$J$84)","v":""},{"$f":"IF(Fixtures!$K$84=\"\",\"\",Fixtures!$K$84)","v":""},{"$f":"IF(I81=\"\",\"\",IF(J81=\"\",\"\",IF(I81>J81,\"W\",IF(I81=J81,\"D\",IF(I81<J81,\"L\",\"\")))))","v":""},{"$f":"IF(Fixtures!$J$83=\"\",\"\",Fixtures!$J$83)","v":""},{"$f":"IF(Fixtures!$K$83=\"\",\"\",Fixtures!$K$83)","v":""},{"$f":"IF(L81=\"\",\"\",IF(M81=\"\",\"\",IF(L81>M81,\"W\",IF(L81=M81,\"D\",IF(L81<M81,\"L\",\"\")))))","v":""},null,{"$f":"SUM(Q81)+SUM(R81)+SUM(S81)","v":0},{"$f":"IF(H80=\"L\",1,0)+IF(K81=\"W\",1,0)+IF(N81=\"W\",1,0)","v":0},{"$f":"IF(H80=\"D\",1,0)+IF(K81=\"D\",1,0)+IF(N81=\"D\",1,0)","v":0},{"$f":"IF(H80=\"W\",1,0)+IF(K81=\"L\",1,0)+IF(N81=\"L\",1,0)","v":0},{"$f":"SUM(G80)+SUM(I81)+SUM(L81)","v":0},{"$f":"SUM(F80)+SUM(J81)+SUM(M81)","v":0},{"$f":"T81-U81","v":0},{"$f":"SUM(Q81*3)+SUM(R81)","v":0}]
[null,{"$f":"Fixtures!G80","v":"England"},null,null,null,null,null,null,null,null,null,{"$f":"IF(Fixtures!$J$80=\"\",\"\",Fixtures!$J$80)","v":""},{"$f":"IF(Fixtures!$K$80=\"\",\"\",Fixtures!$K$80)","v":""},{"$f":"IF(L82=\"\",\"\",IF(M82=\"\",\"\",IF(L82>M82,\"W\",IF(L82=M82,\"D\",IF(L82<M82,\"L\",\"\")))))","v":""},null,{"$f":"SUM(Q82)+SUM(R82)+SUM(S82)","v":0},{"$f":"IF(K80=\"L\",1,0)+IF(K81=\"L\",1,0)+IF(N82=\"W\",1,0)","v":0},{"$f":"IF(K80=\"D\",1,0)+IF(K81=\"D\",1,0)+IF(N82=\"D\",1,0)","v":0},{"$f":"IF(K80=\"W\",1,0)+IF(K81=\"W\",1,0)+IF(N82=\"L\",1,0)","v":0},{"$f":"SUM(J80)+SUM(J81)+SUM(L82)","v":0},{"$f":"SUM(I80)+SUM(I81)+SUM(M82)","v":0},{"$f":"T82-U82","v":0},{"$f":"SUM(Q82*3)+SUM(R82)","v":0}]
[null,{"$f":"Fixtures!I80","v":"Croatia"},null,null,null,null,null,null,null,null,null,null,null,null,null,{"$f":"SUM(Q83)+SUM(R83)+SUM(S83)","v":0},{"$f":"IF(N80=\"L\",1,0)+IF(N81=\"L\",1,0)+IF(N82=\"L\",1,0)","v":0},{"$f":"IF(N80=\"D\",1,0)+IF(N81=\"D\",1,0)+IF(N82=\"D\",1,0)","v":0},{"$f":"IF(N80=\"W\",1,0)+IF(N81=\"W\",1,0)+IF(N82=\"W\",1,0)","v":0},{"$f":"SUM(M80)+SUM(M81)+SUM(M82)","v":0},{"$f":"SUM(L80)+SUM(L81)+SUM(L82)","v":0},{"$f":"T83-U83","v":0},{"$f":"SUM(Q83*3)+SUM(R83)","v":0}]
[null,null,null,null,null,null,null,null,null,null,null,null,null,null,null,{"$f":"IF(SUM(P80:P83)=12,\"Final Table\",\"Incomplete\")","v":"Incomplete"}]

{"sheet":"Ladders","index":2,"n_rows":100,"n_cols":12,"rows_kept":100,"cut":false,"hidden":false,"merged":[]}
[{"$f":"McRopod!K1","v":"V1 - 221225"}]
[]
[]
[null,null,{"$f":"LaddersH!B4","v":"Incomplete"},{"$f":"LaddersH!C4","v":"P"},{"$f":"LaddersH!D4","v":"W"},{"$f":"LaddersH!E4","v":"D"},{"$f":"LaddersH!F4","v":"L"},{"$f":"LaddersH!G4","v":"F"},{"$f":"LaddersH!H4","v":"A"},{"$f":"LaddersH!I4","v":"GD"},{"$f":"LaddersH!J4","v":"Pts"}]
[null,null,{"$f":"LaddersH!B5","v":"South Korea"},{"$f":"LaddersH!C5","v":0},{"$f":"LaddersH!D5","v":0},{"$f":"LaddersH!E5","v":0},{"$f":"LaddersH!F5","v":0},{"$f":"LaddersH!G5","v":0},{"$f":"LaddersH!H5","v":0},{"$f":"LaddersH!I5","v":0},{"$f":"LaddersH!J5","v":0},{"$f":"LaddersH!Q5","v":""}]
[null,null,{"$f":"LaddersH!B6","v":"Mexico"},{"$f":"LaddersH!C6","v":0},{"$f":"LaddersH!D6","v":0},{"$f":"LaddersH!E6","v":0},{"$f":"LaddersH!F6","v":0},{"$f":"LaddersH!G6","v":0},{"$f":"LaddersH!H6","v":0},{"$f":"LaddersH!I6","v":0},{"$f":"LaddersH!J6","v":0},{"$f":"LaddersH!Q6","v":""}]
[null,null,{"$f":"LaddersH!B7","v":"(DEN/MKD/CZE/IRL)"},{"$f":"LaddersH!C7","v":0},{"$f":"LaddersH!D7","v":0},{"$f":"LaddersH!E7","v":0},{"$f":"LaddersH!F7","v":0},{"$f":"LaddersH!G7","v":0},{"$f":"LaddersH!H7","v":0},{"$f":"LaddersH!I7","v":0},{"$f":"LaddersH!J7","v":0},{"$f":"LaddersH!Q7","v":""}]
[null,null,{"$f":"LaddersH!B8","v":"South Africa"},{"$f":"LaddersH!C8","v":0},{"$f":"LaddersH!D8","v":0},{"$f":"LaddersH!E8","v":0},{"$f":"LaddersH!F8","v":0},{"$f":"LaddersH!G8","v":0},{"$f":"LaddersH!H8","v":0},{"$f":"LaddersH!I8","v":0},{"$f":"LaddersH!J8","v":0},{"$f":"LaddersH!Q8","v":"Table OK"}]
[null,null,null,null,null,null,null,null,null,null,{"$f":"LaddersH!M9","v":""}]
[]
[null,null,{"$f":"LaddersH!B11","v":"Incomplete"},{"$f":"LaddersH!C11","v":"P"},{"$f":"LaddersH!D11","v":"W"},{"$f":"LaddersH!E11","v":"D"},{"$f":"LaddersH!F11","v":"L"},{"$f":"LaddersH!G11","v":"F"},{"$f":"LaddersH!H11","v":"A"},{"$f":"LaddersH!I11","v":"GD"},{"$f":"LaddersH!J11","v":"Pts"}]
[null,null,{"$f":"LaddersH!B12","v":"(ITA,NRL,WAL,BIH)"},{"$f":"LaddersH!C12","v":0},{"$f":"LaddersH!D12","v":0},{"$f":"LaddersH!E12","v":0},{"$f":"LaddersH!F12","v":0},{"$f":"LaddersH!G12","v":0},{"$f":"LaddersH!H12","v":0},{"$f":"LaddersH!I12","v":0},{"$f":"LaddersH!J12","v":0},{"$f":"LaddersH!Q12","v":""}]
[null,null,{"$f":"LaddersH!B13","v":"Switzerland"},{"$f":"LaddersH!C13","v":0},{"$f":"LaddersH!D13","v":0},{"$f":"LaddersH!E13","v":0},{"$f":"LaddersH!F13","v":0},{"$f":"LaddersH!G13","v":0},{"$f":"LaddersH!H13","v":0},{"$f":"LaddersH!I13","v":0},{"$f":"LaddersH!J13","v":0},{"$f":"LaddersH!Q13","v":""}]
[null,null,{"$f":"LaddersH!B14","v":"Canada"},{"$f":"LaddersH!C14","v":0},{"$f":"LaddersH!D14","v":0},{"$f":"LaddersH!E14","v":0},{"$f":"LaddersH!F14","v":0},{"$f":"LaddersH!G14","v":0},{"$f":"LaddersH!H14","v":0},{"$f":"LaddersH!I14","v":0},{"$f":"LaddersH!J14","v":0},{"$f":"LaddersH!Q14","v":""}]
[null,null,{"$f":"LaddersH!B15","v":"Qatar"},{"$f":"LaddersH!C15","v":0},{"$f":"LaddersH!D15","v":0},{"$f":"LaddersH!E15","v":0},{"$f":"LaddersH!F15","v":0},{"$f":"LaddersH!G15","v":0},{"$f":"LaddersH!H15","v":0},{"$f":"LaddersH!I15","v":0},{"$f":"LaddersH!J15","v":0},{"$f":"LaddersH!Q15","v":"Table OK"}]
[null,null,null,null,null,null,null,null,null,null,{"$f":"LaddersH!M16","v":""}]
[]
[null,null,{"$f":"LaddersH!B18","v":"Incomplete"},{"$f":"LaddersH!C18","v":"P"},{"$f":"LaddersH!D18","v":"W"},{"$f":"LaddersH!E18","v":"D"},{"$f":"LaddersH!F18","v":"L"},{"$f":"LaddersH!G18","v":"F"},{"$f":"LaddersH!H18","v":"A"},{"$f":"LaddersH!I18","v":"GD"},{"$f":"LaddersH!J18","v":"Pts"}]
[null,null,{"$f":"LaddersH!B19","v":"Brazil"},{"$f":"LaddersH!C19","v":0},{"$f":"LaddersH!D19","v":0},{"$f":"LaddersH!E19","v":0},{"$f":"LaddersH!F19","v":0},{"$f":"LaddersH!G19","v":0},{"$f":"LaddersH!H19","v":0},{"$f":"LaddersH!I19","v":0},{"$f":"LaddersH!J19","v":0},{"$f":"LaddersH!Q19","v":""}]
[null,null,{"$f":"LaddersH!B20","v":"Scotland"},{"$f":"LaddersH!C20","v":0},{"$f":"LaddersH!D20","v":0},{"$f":"LaddersH!E20","v":0},{"$f":"LaddersH!F20","v":0},{"$f":"LaddersH!G20","v":0},{"$f":"LaddersH!H20","v":0},{"$f":"LaddersH!I20","v":0},{"$f":"LaddersH!J20","v":0},{"$f":"LaddersH!Q20","v":""}]
[null,null,{"$f":"LaddersH!B21","v":"Morocco"},{"$f":"LaddersH!C21","v":0},{"$f":"LaddersH!D21","v":0},{"$f":"LaddersH!E21","v":0},{"$f":"LaddersH!F21","v":0},{"$f":"LaddersH!G21","v":0},{"$f":"LaddersH!H21","v":0},{"$f":"LaddersH!I21","v":0},{"$f":"LaddersH!J21","v":0},{"$f":"LaddersH!Q21","v":""}]
[null,null,{"$f":"LaddersH!B22","v":"Haiti"},{"$f":"LaddersH!C22","v":0},{"$f":"LaddersH!D22","v":0},{"$f":"LaddersH!E22","v":0},{"$f":"LaddersH!F22","v":0},{"$f":"LaddersH!G22","v":0},{"$f":"LaddersH!H22","v":0},{"$f":"LaddersH!I22","v":0},{"$f":"LaddersH!J22","v":0},{"$f":"LaddersH!Q22","v":"Table OK"}]
[null,null,null,null,null,null,null,null,null,null,{"$f":"LaddersH!M23","v":""}]
[]
[null,null,{"$f":"LaddersH!B25","v":"Incomplete"},{"$f":"LaddersH!C25","v":"P"},{"$f":"LaddersH!D25","v":"W"},{"$f":"LaddersH!E25","v":"D"},{"$f":"LaddersH!F25","v":"L"},{"$f":"LaddersH!G25","v":"F"},{"$f":"LaddersH!H25","v":"A"},{"$f":"LaddersH!I25","v":"GD"},{"$f":"LaddersH!J25","v":"Pts"}]
[null,null,{"$f":"LaddersH!B26","v":"Australia"},{"$f":"LaddersH!C26","v":0},{"$f":"LaddersH!D26","v":0},{"$f":"LaddersH!E26","v":0},{"$f":"LaddersH!F26","v":0},{"$f":"LaddersH!G26","v":0},{"$f":"LaddersH!H26","v":0},{"$f":"LaddersH!I26","v":0},{"$f":"LaddersH!J26","v":0},{"$f":"LaddersH!Q26","v":""}]
[null,null,{"$f":"LaddersH!B27","v":"Paraguay"},{"$f":"LaddersH!C27","v":0},{"$f":"LaddersH!D27","v":0},{"$f":"LaddersH!E27","v":0},{"$f":"LaddersH!F27","v":0},{"$f":"LaddersH!G27","v":0},{"$f":"LaddersH!H27","v":0},{"$f":"LaddersH!I27","v":0},{"$f":"LaddersH!J27","v":0},{"$f":"LaddersH!Q27","v":""}]
[null,null,{"$f":"LaddersH!B28","v":"(TUR,ROM,SVK,KOS)"},{"$f":"LaddersH!C28","v":0},{"$f":"LaddersH!D28","v":0},{"$f":"LaddersH!E28","v":0},{"$f":"LaddersH!F28","v":0},{"$f":"LaddersH!G28","v":0},{"$f":"LaddersH!H28","v":0},{"$f":"LaddersH!I28","v":0},{"$f":"LaddersH!J28","v":0},{"$f":"LaddersH!Q28","v":""}]
[null,null,{"$f":"LaddersH!B29","v":"USA"},{"$f":"LaddersH!C29","v":0},{"$f":"LaddersH!D29","v":0},{"$f":"LaddersH!E29","v":0},{"$f":"LaddersH!F29","v":0},{"$f":"LaddersH!G29","v":0},{"$f":"LaddersH!H29","v":0},{"$f":"LaddersH!I29","v":0},{"$f":"LaddersH!J29","v":0},{"$f":"LaddersH!Q29","v":"Table OK"}]
[null,null,null,null,null,null,null,null,null,null,{"$f":"LaddersH!M30","v":""}]
[]
[null,null,{"$f":"LaddersH!B32","v":"Incomplete"},{"$f":"LaddersH!C32","v":"P"},{"$f":"LaddersH!D32","v":"W"},{"$f":"LaddersH!E32","v":"D"},{"$f":"LaddersH!F32","v":"L"},{"$f":"LaddersH!G32","v":"F"},{"$f":"LaddersH!H32","v":"A"},{"$f":"LaddersH!I32","v":"GD"},{"$f":"LaddersH!J32","v":"Pts"}]
[null,null,{"$f":"LaddersH!B33","v":"Germany"},{"$f":"LaddersH!C33","v":0},{"$f":"LaddersH!D33","v":0},{"$f":"LaddersH!E33","v":0},{"$f":"LaddersH!F33","v":0},{"$f":"LaddersH!G33","v":0},{"$f":"LaddersH!H33","v":0},{"$f":"LaddersH!I33","v":0},{"$f":"LaddersH!J33","v":0},{"$f":"LaddersH!Q33","v":""}]
[null,null,{"$f":"LaddersH!B34","v":"Côte d'Ivoire"},{"$f":"LaddersH!C34","v":0},{"$f":"LaddersH!D34","v":0},{"$f":"LaddersH!E34","v":0},{"$f":"LaddersH!F34","v":0},{"$f":"LaddersH!G34","v":0},{"$f":"LaddersH!H34","v":0},{"$f":"LaddersH!I34","v":0},{"$f":"LaddersH!J34","v":0},{"$f":"LaddersH!Q34","v":""}]
[null,null,{"$f":"LaddersH!B35","v":"Ecuador"},{"$f":"LaddersH!C35","v":0},{"$f":"LaddersH!D35","v":0},{"$f":"LaddersH!E35","v":0},{"$f":"LaddersH!F35","v":0},{"$f":"LaddersH!G35","v":0},{"$f":"LaddersH!H35","v":0},{"$f":"LaddersH!I35","v":0},{"$f":"LaddersH!J35","v":0},{"$f":"LaddersH!Q35","v":""}]
[null,null,{"$f":"LaddersH!B36","v":"Curaçao"},{"$f":"LaddersH!C36","v":0},{"$f":"LaddersH!D36","v":0},{"$f":"LaddersH!E36","v":0},{"$f":"LaddersH!F36","v":0},{"$f":"LaddersH!G36","v":0},{"$f":"LaddersH!H36","v":0},{"$f":"LaddersH!I36","v":0},{"$f":"LaddersH!J36","v":0},{"$f":"LaddersH!Q36","v":"Table OK"}]
[null,null,null,null,null,null,null,null,null,null,{"$f":"LaddersH!M37","v":""}]
[]
[null,null,{"$f":"LaddersH!B39","v":"Incomplete"},{"$f":"LaddersH!C39","v":"P"},{"$f":"LaddersH!D39","v":"W"},{"$f":"LaddersH!E39","v":"D"},{"$f":"LaddersH!F39","v":"L"},{"$f":"LaddersH!G39","v":"F"},{"$f":"LaddersH!H39","v":"A"},{"$f":"LaddersH!I39","v":"GD"},{"$f":"LaddersH!J39","v":"Pts"}]
[null,null,{"$f":"LaddersH!B40","v":"Netherlands"},{"$f":"LaddersH!C40","v":0},{"$f":"LaddersH!D40","v":0},{"$f":"LaddersH!E40","v":0},{"$f":"LaddersH!F40","v":0},{"$f":"LaddersH!G40","v":0},{"$f":"LaddersH!H40","v":0},{"$f":"LaddersH!I40","v":0},{"$f":"LaddersH!J40","v":0},{"$f":"LaddersH!Q40","v":""}]
[null,null,{"$f":"LaddersH!B41","v":"Japan"},{"$f":"LaddersH!C41","v":0},{"$f":"LaddersH!D41","v":0},{"$f":"LaddersH!E41","v":0},{"$f":"LaddersH!F41","v":0},{"$f":"LaddersH!G41","v":0},{"$f":"LaddersH!H41","v":0},{"$f":"LaddersH!I41","v":0},{"$f":"LaddersH!J41","v":0},{"$f":"LaddersH!Q41","v":""}]
[null,null,{"$f":"LaddersH!B42","v":"(UKR,SWE,POL,ALB)"},{"$f":"LaddersH!C42","v":0},{"$f":"LaddersH!D42","v":0},{"$f":"LaddersH!E42","v":0},{"$f":"LaddersH!F42","v":0},{"$f":"LaddersH!G42","v":0},{"$f":"LaddersH!H42","v":0},{"$f":"LaddersH!I42","v":0},{"$f":"LaddersH!J42","v":0},{"$f":"LaddersH!Q42","v":""}]
[null,null,{"$f":"LaddersH!B43","v":"Tunisia"},{"$f":"LaddersH!C43","v":0},{"$f":"LaddersH!D43","v":0},{"$f":"LaddersH!E43","v":0},{"$f":"LaddersH!F43","v":0},{"$f":"LaddersH!G43","v":0},{"$f":"LaddersH!H43","v":0},{"$f":"LaddersH!I43","v":0},{"$f":"LaddersH!J43","v":0},{"$f":"LaddersH!Q43","v":"Table OK"}]
[null,null,null,null,null,null,null,null,null,null,{"$f":"LaddersH!M44","v":""}]
[]
[null,null,{"$f":"LaddersH!B46","v":"Incomplete"},{"$f":"LaddersH!C46","v":"P"},{"$f":"LaddersH!D46","v":"W"},{"$f":"LaddersH!E46","v":"D"},{"$f":"LaddersH!F46","v":"L"},{"$f":"LaddersH!G46","v":"F"},{"$f":"LaddersH!H46","v":"A"},{"$f":"LaddersH!I46","v":"GD"},{"$f":"LaddersH!J46","v":"Pts"}]
[null,null,{"$f":"LaddersH!B47","v":"Belgium"},{"$f":"LaddersH!C47","v":0},{"$f":"LaddersH!D47","v":0},{"$f":"LaddersH!E47","v":0},{"$f":"LaddersH!F47","v":0},{"$f":"LaddersH!G47","v":0},{"$f":"LaddersH!H47","v":0},{"$f":"LaddersH!I47","v":0},{"$f":"LaddersH!J47","v":0},{"$f":"LaddersH!Q47","v":""}]
[null,null,{"$f":"LaddersH!B48","v":"Egypt"},{"$f":"LaddersH!C48","v":0},{"$f":"LaddersH!D48","v":0},{"$f":"LaddersH!E48","v":0},{"$f":"LaddersH!F48","v":0},{"$f":"LaddersH!G48","v":0},{"$f":"LaddersH!H48","v":0},{"$f":"LaddersH!I48","v":0},{"$f":"LaddersH!J48","v":0},{"$f":"LaddersH!Q48","v":""}]
[null,null,{"$f":"LaddersH!B49","v":"Iran"},{"$f":"LaddersH!C49","v":0},{"$f":"LaddersH!D49","v":0},{"$f":"LaddersH!E49","v":0},{"$f":"LaddersH!F49","v":0},{"$f":"LaddersH!G49","v":0},{"$f":"LaddersH!H49","v":0},{"$f":"LaddersH!I49","v":0},{"$f":"LaddersH!J49","v":0},{"$f":"LaddersH!Q49","v":""}]
[null,null,{"$f":"LaddersH!B50","v":"NewZealand"},{"$f":"LaddersH!C50","v":0},{"$f":"LaddersH!D50","v":0},{"$f":"LaddersH!E50","v":0},{"$f":"LaddersH!F50","v":0},{"$f":"LaddersH!G50","v":0},{"$f":"LaddersH!H50","v":0},{"$f":"LaddersH!I50","v":0},{"$f":"LaddersH!J50","v":0},{"$f":"LaddersH!Q50","v":"Table OK"}]
[null,null,null,null,null,null,null,null,null,null,{"$f":"LaddersH!M51","v":""}]
[]
[null,null,{"$f":"LaddersH!B53","v":"Incomplete"},{"$f":"LaddersH!C53","v":"P"},{"$f":"LaddersH!D53","v":"W"},{"$f":"LaddersH!E53","v":"D"},{"$f":"LaddersH!F53","v":"L"},{"$f":"LaddersH!G53","v":"F"},{"$f":"LaddersH!H53","v":"A"},{"$f":"LaddersH!I53","v":"GD"},{"$f":"LaddersH!J53","v":"Pts"}]
[null,null,{"$f":"LaddersH!B54","v":"Spain"},{"$f":"LaddersH!C54","v":0},{"$f":"LaddersH!D54","v":0},{"$f":"LaddersH!E54","v":0},{"$f":"LaddersH!F54","v":0},{"$f":"LaddersH!G54","v":0},{"$f":"LaddersH!H54","v":0},{"$f":"LaddersH!I54","v":0},{"$f":"LaddersH!J54","v":0},{"$f":"LaddersH!Q54","v":""}]
[null,null,{"$f":"LaddersH!B55","v":"Uruguay"},{"$f":"LaddersH!C55","v":0},{"$f":"LaddersH!D55","v":0},{"$f":"LaddersH!E55","v":0},{"$f":"LaddersH!F55","v":0},{"$f":"LaddersH!G55","v":0},{"$f":"LaddersH!H55","v":0},{"$f":"LaddersH!I55","v":0},{"$f":"LaddersH!J55","v":0},{"$f":"LaddersH!Q55","v":""}]
[null,null,{"$f":"LaddersH!B56","v":"Saudi Arabia"},{"$f":"LaddersH!C56","v":0},{"$f":"LaddersH!D56","v":0},{"$f":"LaddersH!E56","v":0},{"$f":"LaddersH!F56","v":0},{"$f":"LaddersH!G56","v":0},{"$f":"LaddersH!H56","v":0},{"$f":"LaddersH!I56","v":0},{"$f":"LaddersH!J56","v":0},{"$f":"LaddersH!Q56","v":""}]
[null,null,{"$f":"LaddersH!B57","v":"Cape Verde"},{"$f":"LaddersH!C57","v":0},{"$f":"LaddersH!D57","v":0},{"$f":"LaddersH!E57","v":0},{"$f":"LaddersH!F57","v":0},{"$f":"LaddersH!G57","v":0},{"$f":"LaddersH!H57","v":0},{"$f":"LaddersH!I57","v":0},{"$f":"LaddersH!J57","v":0},{"$f":"LaddersH!Q57","v":"Table OK"}]
[null,null,null,null,null,null,null,null,null,null,{"$f":"LaddersH!M58","v":""}]
[]
[null,null,{"$f":"LaddersH!B60","v":"Incomplete"},{"$f":"LaddersH!C60","v":"P"},{"$f":"LaddersH!D60","v":"W"},{"$f":"LaddersH!E60","v":"D"},{"$f":"LaddersH!F60","v":"L"},{"$f":"LaddersH!G60","v":"F"},{"$f":"LaddersH!H60","v":"A"},{"$f":"LaddersH!I60","v":"GD"},{"$f":"LaddersH!J60","v":"Pts"}]
[null,null,{"$f":"LaddersH!B61","v":"Norway"},{"$f":"LaddersH!C61","v":0},{"$f":"LaddersH!D61","v":0},{"$f":"LaddersH!E61","v":0},{"$f":"LaddersH!F61","v":0},{"$f":"LaddersH!G61","v":0},{"$f":"LaddersH!H61","v":0},{"$f":"LaddersH!I61","v":0},{"$f":"LaddersH!J61","v":0},{"$f":"LaddersH!Q61","v":""}]
[null,null,{"$f":"LaddersH!B62","v":"France"},{"$f":"LaddersH!C62","v":0},{"$f":"LaddersH!D62","v":0},{"$f":"LaddersH!E62","v":0},{"$f":"LaddersH!F62","v":0},{"$f":"LaddersH!G62","v":0},{"$f":"LaddersH!H62","v":0},{"$f":"LaddersH!I62","v":0},{"$f":"LaddersH!J62","v":0},{"$f":"LaddersH!Q62","v":""}]
[null,null,{"$f":"LaddersH!B63","v":"Senegal"},{"$f":"LaddersH!C63","v":0},{"$f":"LaddersH!D63","v":0},{"$f":"LaddersH!E63","v":0},{"$f":"LaddersH!F63","v":0},{"$f":"LaddersH!G63","v":0},{"$f":"LaddersH!H63","v":0},{"$f":"LaddersH!I63","v":0},{"$f":"LaddersH!J63","v":0},{"$f":"LaddersH!Q63","v":""}]
[null,null,{"$f":"LaddersH!B64","v":"(BOL,SUR,IRQ)"},{"$f":"LaddersH!C64","v":0},{"$f":"LaddersH!D64","v":0},{"$f":"LaddersH!E64","v":0},{"$f":"LaddersH!F64","v":0},{"$f":"LaddersH!G64","v":0},{"$f":"LaddersH!H64","v":0},{"$f":"LaddersH!I64","v":0},{"$f":"LaddersH!J64","v":0},{"$f":"LaddersH!Q64","v":"Table OK"}]
[null,null,null,null,null,null,null,null,null,null,{"$f":"LaddersH!M65","v":""}]
[]
[null,null,{"$f":"LaddersH!B67","v":"Incomplete"},{"$f":"LaddersH!C67","v":"P"},{"$f":"LaddersH!D67","v":"W"},{"$f":"LaddersH!E67","v":"D"},{"$f":"LaddersH!F67","v":"L"},{"$f":"LaddersH!G67","v":"F"},{"$f":"LaddersH!H67","v":"A"},{"$f":"LaddersH!I67","v":"GD"},{"$f":"LaddersH!J67","v":"Pts"}]
[null,null,{"$f":"LaddersH!B68","v":"Argentina"},{"$f":"LaddersH!C68","v":0},{"$f":"LaddersH!D68","v":0},{"$f":"LaddersH!E68","v":0},{"$f":"LaddersH!F68","v":0},{"$f":"LaddersH!G68","v":0},{"$f":"LaddersH!H68","v":0},{"$f":"LaddersH!I68","v":0},{"$f":"LaddersH!J68","v":0},{"$f":"LaddersH!Q68","v":""}]
[null,null,{"$f":"LaddersH!B69","v":"Austria"},{"$f":"LaddersH!C69","v":0},{"$f":"LaddersH!D69","v":0},{"$f":"LaddersH!E69","v":0},{"$f":"LaddersH!F69","v":0},{"$f":"LaddersH!G69","v":0},{"$f":"LaddersH!H69","v":0},{"$f":"LaddersH!I69","v":0},{"$f":"LaddersH!J69","v":0},{"$f":"LaddersH!Q69","v":""}]
[null,null,{"$f":"LaddersH!B70","v":"Algeria"},{"$f":"LaddersH!C70","v":0},{"$f":"LaddersH!D70","v":0},{"$f":"LaddersH!E70","v":0},{"$f":"LaddersH!F70","v":0},{"$f":"LaddersH!G70","v":0},{"$f":"LaddersH!H70","v":0},{"$f":"LaddersH!I70","v":0},{"$f":"LaddersH!J70","v":0},{"$f":"LaddersH!Q70","v":""}]
[null,null,{"$f":"LaddersH!B71","v":"Jordan"},{"$f":"LaddersH!C71","v":0},{"$f":"LaddersH!D71","v":0},{"$f":"LaddersH!E71","v":0},{"$f":"LaddersH!F71","v":0},{"$f":"LaddersH!G71","v":0},{"$f":"LaddersH!H71","v":0},{"$f":"LaddersH!I71","v":0},{"$f":"LaddersH!J71","v":0},{"$f":"LaddersH!Q71","v":"Table OK"}]
[null,null,null,null,null,null,null,null,null,null,{"$f":"LaddersH!M72","v":""}]
[]
[null,null,{"$f":"LaddersH!B74","v":"Incomplete"},{"$f":"LaddersH!C74","v":"P"},{"$f":"LaddersH!D74","v":"W"},{"$f":"LaddersH!E74","v":"D"},{"$f":"LaddersH!F74","v":"L"},{"$f":"LaddersH!G74","v":"F"},{"$f":"LaddersH!H74","v":"A"},{"$f":"LaddersH!I74","v":"GD"},{"$f":"LaddersH!J74","v":"Pts"}]
[null,null,{"$f":"LaddersH!B75","v":"Portugal"},{"$f":"LaddersH!C75","v":0},{"$f":"LaddersH!D75","v":0},{"$f":"LaddersH!E75","v":0},{"$f":"LaddersH!F75","v":0},{"$f":"LaddersH!G75","v":0},{"$f":"LaddersH!H75","v":0},{"$f":"LaddersH!I75","v":0},{"$f":"LaddersH!J75","v":0},{"$f":"LaddersH!Q75","v":""}]
[null,null,{"$f":"LaddersH!B76","v":"Colombia"},{"$f":"LaddersH!C76","v":0},{"$f":"LaddersH!D76","v":0},{"$f":"LaddersH!E76","v":0},{"$f":"LaddersH!F76","v":0},{"$f":"LaddersH!G76","v":0},{"$f":"LaddersH!H76","v":0},{"$f":"LaddersH!I76","v":0},{"$f":"LaddersH!J76","v":0},{"$f":"LaddersH!Q76","v":""}]
[null,null,{"$f":"LaddersH!B77","v":"Uzbekistan"},{"$f":"LaddersH!C77","v":0},{"$f":"LaddersH!D77","v":0},{"$f":"LaddersH!E77","v":0},{"$f":"LaddersH!F77","v":0},{"$f":"LaddersH!G77","v":0},{"$f":"LaddersH!H77","v":0},{"$f":"LaddersH!I77","v":0},{"$f":"LaddersH!J77","v":0},{"$f":"LaddersH!Q77","v":""}]
[null,null,{"$f":"LaddersH!B78","v":"(NCL,JAM,COD)"},{"$f":"LaddersH!C78","v":0},{"$f":"LaddersH!D78","v":0},{"$f":"LaddersH!E78","v":0},{"$f":"LaddersH!F78","v":0},{"$f":"LaddersH!G78","v":0},{"$f":"LaddersH!H78","v":0},{"$f":"LaddersH!I78","v":0},{"$f":"LaddersH!J78","v":0},{"$f":"LaddersH!Q78","v":"Table OK"}]
[null,null,null,null,null,null,null,null,null,null,{"$f":"LaddersH!M79","v":""}]
[]
[null,null,{"$f":"LaddersH!B81","v":"Incomplete"},{"$f":"LaddersH!C81","v":"P"},{"$f":"LaddersH!D81","v":"W"},{"$f":"LaddersH!E81","v":"D"},{"$f":"LaddersH!F81","v":"L"},{"$f":"LaddersH!G81","v":"F"},{"$f":"LaddersH!H81","v":"A"},{"$f":"LaddersH!I81","v":"GD"},{"$f":"LaddersH!J81","v":"Pts"}]
[null,null,{"$f":"LaddersH!B82","v":"Croatia"},{"$f":"LaddersH!C82","v":0},{"$f":"LaddersH!D82","v":0},{"$f":"LaddersH!E82","v":0},{"$f":"LaddersH!F82","v":0},{"$f":"LaddersH!G82","v":0},{"$f":"LaddersH!H82","v":0},{"$f":"LaddersH!I82","v":0},{"$f":"LaddersH!J82","v":0},{"$f":"LaddersH!Q82","v":""}]
[null,null,{"$f":"LaddersH!B83","v":"Ghana"},{"$f":"LaddersH!C83","v":0},{"$f":"LaddersH!D83","v":0},{"$f":"LaddersH!E83","v":0},{"$f":"LaddersH!F83","v":0},{"$f":"LaddersH!G83","v":0},{"$f":"LaddersH!H83","v":0},{"$f":"LaddersH!I83","v":0},{"$f":"LaddersH!J83","v":0},{"$f":"LaddersH!Q83","v":""}]
[null,null,{"$f":"LaddersH!B84","v":"Panama"},{"$f":"LaddersH!C84","v":0},{"$f":"LaddersH!D84","v":0},{"$f":"LaddersH!E84","v":0},{"$f":"LaddersH!F84","v":0},{"$f":"LaddersH!G84","v":0},{"$f":"LaddersH!H84","v":0},{"$f":"LaddersH!I84","v":0},{"$f":"LaddersH!J84","v":0},{"$f":"LaddersH!Q84","v":""}]
[null,null,{"$f":"LaddersH!B85","v":"England"},{"$f":"LaddersH!C85","v":0},{"$f":"LaddersH!D85","v":0},{"$f":"LaddersH!E85","v":0},{"$f":"LaddersH!F85","v":0},{"$f":"LaddersH!G85","v":0},{"$f":"LaddersH!H85","v":0},{"$f":"LaddersH!I85","v":0},{"$f":"LaddersH!J85","v":0},{"$f":"LaddersH!Q85","v":"Table OK"}]
[null,null,null,null,null,null,null,null,null,null,{"$f":"LaddersH!M86","v":""}]
[]
[null,null,{"$f":"LaddersH!B91","v":"Incomplete"},{"$f":"LaddersH!C91","v":"P"},{"$f":"LaddersH!D91","v":"W"},{"$f":"LaddersH!E91","v":"D"},{"$f":"LaddersH!F91","v":"L"},{"$f":"LaddersH!G91","v":"F"},{"$f":"LaddersH!H91","v":"A"},{"$f":"LaddersH!I91","v":"GD"},{"$f":"LaddersH!J91","v":"Pts"}]
[null,null,{"$f":"LaddersH!B92","v":"(DEN/MKD/CZE/IRL)"},{"$f":"LaddersH!C92","v":0},{"$f":"LaddersH!D92","v":0},{"$f":"LaddersH!E92","v":0},{"$f":"LaddersH!F92","v":0},{"$f":"LaddersH!G92","v":0},{"$f":"LaddersH!H92","v":0},{"$f":"LaddersH!I92","v":0},{"$f":"LaddersH!J92","v":0}]
[null,null,{"$f":"LaddersH!B93","v":"Uzbekistan"},{"$f":"LaddersH!C93","v":0},{"$f":"LaddersH!D93","v":0},{"$f":"LaddersH!E93","v":0},{"$f":"LaddersH!F93","v":0},{"$f":"LaddersH!G93","v":0},{"$f":"LaddersH!H93","v":0},{"$f":"LaddersH!I93","v":0},{"$f":"LaddersH!J93","v":0}]
[null,null,{"$f":"LaddersH!B94","v":"Algeria"},{"$f":"LaddersH!C94","v":0},{"$f":"LaddersH!D94","v":0},{"$f":"LaddersH!E94","v":0},{"$f":"LaddersH!F94","v":0},{"$f":"LaddersH!G94","v":0},{"$f":"LaddersH!H94","v":0},{"$f":"LaddersH!I94","v":0},{"$f":"LaddersH!J94","v":0}]
[null,null,{"$f":"LaddersH!B95","v":"Panama"},{"$f":"LaddersH!C95","v":0},{"$f":"LaddersH!D95","v":0},{"$f":"LaddersH!E95","v":0},{"$f":"LaddersH!F95","v":0},{"$f":"LaddersH!G95","v":0},{"$f":"LaddersH!H95","v":0},{"$f":"LaddersH!I95","v":0},{"$f":"LaddersH!J95","v":0}]
[null,null,{"$f":"LaddersH!B96","v":"Senegal"},{"$f":"LaddersH!C96","v":0},{"$f":"LaddersH!D96","v":0},{"$f":"LaddersH!E96","v":0},{"$f":"LaddersH!F96","v":0},{"$f":"LaddersH!G96","v":0},{"$f":"LaddersH!H96","v":0},{"$f":"LaddersH!I96","v":0},{"$f":"LaddersH!J96","v":0}]
[null,null,{"$f":"LaddersH!B97","v":"Canada"},{"$f":"LaddersH!C97","v":0},{"$f":"LaddersH!D97","v":0},{"$f":"LaddersH!E97","v":0},{"$f":"LaddersH!F97","v":0},{"$f":"LaddersH!G97","v":0},{"$f":"LaddersH!H97","v":0},{"$f":"LaddersH!I97","v":0},{"$f":"LaddersH!J97","v":0}]
[null,null,{"$f":"LaddersH!B98","v":"(UKR,SWE,POL,ALB)"},{"$f":"LaddersH!C98","v":0},{"$f":"LaddersH!D98","v":0},{"$f":"LaddersH!E98","v":0},{"$f":"LaddersH!F98","v":0},{"$f":"LaddersH!G98","v":0},{"$f":"LaddersH!H98","v":0},{"$f":"LaddersH!I98","v":0},{"$f":"LaddersH!J98","v":0}]
[null,null,{"$f":"LaddersH!B99","v":"(TUR,ROM,SVK,KOS)"},{"$f":"LaddersH!C99","v":0},{"$f":"LaddersH!D99","v":0},{"$f":"LaddersH!E99","v":0},{"$f":"LaddersH!F99","v":0},{"$f":"LaddersH!G99","v":0},{"$f":"LaddersH!H99","v":0},{"$f":"LaddersH!I99","v":0},{"$f":"LaddersH!J99","v":0}]
[null,null,{"$f":"LaddersH!B100","v":"Egypt"},{"$f":"LaddersH!C100","v":0},{"$f":"LaddersH!D100","v":0},{"$f":"LaddersH!E100","v":0},{"$f":"LaddersH!F100","v":0},{"$f":"LaddersH!G100","v":0},{"$f":"LaddersH!H100","v":0},{"$f":"LaddersH!I100","v":0},{"$f":"LaddersH!J100","v":0}]
[null,null,{"$f":"LaddersH!B101","v":"Morocco"},{"$f":"LaddersH!C101","v":0},{"$f":"LaddersH!D101","v":0},{"$f":"LaddersH!E101","v":0},{"$f":"LaddersH!F101","v":0},{"$f":"LaddersH!G101","v":0},{"$f":"LaddersH!H101","v":0},{"$f":"LaddersH!I101","v":0},{"$f":"LaddersH!J101","v":0}]
[null,null,{"$f":"LaddersH!B102","v":"Ecuador"},{"$f":"LaddersH!C102","v":0},{"$f":"LaddersH!D102","v":0},{"$f":"LaddersH!E102","v":0},{"$f":"LaddersH!F102","v":0},{"$f":"LaddersH!G102","v":0},{"$f":"LaddersH!H102","v":0},{"$f":"LaddersH!I102","v":0},{"$f":"LaddersH!J102","v":0}]
[null,null,{"$f":"LaddersH!B103","v":"Saudi Arabia"},{"$f":"LaddersH!C103","v":0},{"$f":"LaddersH!D103","v":0},{"$f":"LaddersH!E103","v":0},{"$f":"LaddersH!F103","v":0},{"$f":"LaddersH!G103","v":0},{"$f":"LaddersH!H103","v":0},{"$f":"LaddersH!I103","v":0},{"$f":"LaddersH!J103","v":0}]

{"sheet":"Qualif","index":3,"n_rows":34,"n_cols":5,"rows_kept":34,"cut":false,"hidden":false,"merged":[]}
[]
[null,"If Group Tables are Final and sorted, these Teams have Qualified:"]
[null,{"$f":"Ladders!C4","v":"Incomplete"},"1A",{"$f":"Ladders!C5","v":"South Korea"},"v Third (CEFHI)"]
[null,{"$f":"IF(Ladders!L8=\"Table OK\",Ladders!L8,\"Check Table\")","v":"Table OK"},"2A",{"$f":"Ladders!C6","v":"Mexico"},"v Runner-Up Group B"]
[null,{"$f":"Ladders!C11","v":"Incomplete"},"1B",{"$f":"Ladders!C12","v":"(ITA,NRL,WAL,BIH)"},"v Third (EFGIJ)"]
[null,{"$f":"IF(Ladders!L15=\"Table OK\",Ladders!L15,\"Check Table\")","v":"Table OK"},"2B",{"$f":"Ladders!C13","v":"Switzerland"},"v Runner-Up Group A"]
[null,{"$f":"Ladders!C18","v":"Incomplete"},"1C",{"$f":"Ladders!C19","v":"Brazil"},"v Runner-Up Group F"]
[null,{"$f":"IF(Ladders!L22=\"Table OK\",Ladders!L22,\"Check Table\")","v":"Table OK"},"2C",{"$f":"Ladders!C20","v":"Scotland"},"v Winner Group F"]
[null,{"$f":"Ladders!C25","v":"Incomplete"},"1D",{"$f":"Ladders!C26","v":"Australia"},"v Third (BEFIJ)"]
[null,{"$f":"IF(Ladders!L29=\"Table OK\",Ladders!L29,\"Check Table\")","v":"Table OK"},"2D",{"$f":"Ladders!C27","v":"Paraguay"},"v Runner-Up Group G"]
[null,{"$f":"Ladders!C32","v":"Incomplete"},"1E",{"$f":"Ladders!C33","v":"Germany"},"v Third (ABCDF)"]
[null,{"$f":"IF(Ladders!L36=\"Table OK\",Ladders!L36,\"Check Table\")","v":"Table OK"},"2E",{"$f":"Ladders!C34","v":"Côte d'Ivoire"},"v Runner-Up Group I"]
[null,{"$f":"Ladders!C39","v":"Incomplete"},"1F",{"$f":"Ladders!C40","v":"Netherlands"},"v Runner-Up Group C"]
[null,{"$f":"IF(Ladders!L43=\"Table OK\",Ladders!L43,\"Check Table\")","v":"Table OK"},"2F",{"$f":"Ladders!C41","v":"Japan"},"v Winner Group C"]
[null,{"$f":"Ladders!C46","v":"Incomplete"},"1G",{"$f":"Ladders!C47","v":"Belgium"},"v Third (AEHIJ)"]
[null,{"$f":"IF(Ladders!L50=\"Table OK\",Ladders!L50,\"Check Table\")","v":"Table OK"},"2G",{"$f":"Ladders!C48","v":"Egypt"},"v Runner-Up Group D"]
[null,{"$f":"Ladders!C53","v":"Incomplete"},"1H",{"$f":"LaddersH!B54","v":"Spain"},"v Runner-Up Group J"]
[null,{"$f":"IF(Ladders!L57=\"Table OK\",Ladders!L57,\"Check Table\")","v":"Table OK"},"2H",{"$f":"LaddersH!B55","v":"Uruguay"},"v Winner Group J"]
[null,{"$f":"Ladders!C60","v":"Incomplete"},"1I",{"$f":"LaddersH!B61","v":"Norway"},"v Third (CDFGH)"]
[null,{"$f":"IF(Ladders!L64=\"Table OK\",Ladders!L64,\"Check Table\")","v":"Table OK"},"2I",{"$f":"LaddersH!B62","v":"France"},"v Runner-Up Group E"]
[null,{"$f":"Ladders!C67","v":"Incomplete"},"iJ",{"$f":"LaddersH!B68","v":"Argentina"},"v Runner-Up Group H"]
[null,{"$f":"IF(Ladders!L71=\"Table OK\",Ladders!L71,\"Check Table\")","v":"Table OK"},"2J",{"$f":"LaddersH!B69","v":"Austria"},"v Winner Group H"]
[null,{"$f":"Ladders!C74","v":"Incomplete"},"1K",{"$f":"LaddersH!B75","v":"Portugal"},"v Third (DEIJL)"]
[null,{"$f":"IF(Ladders!L78=\"Table OK\",Ladders!L78,\"Check Table\")","v":"Table OK"},"2K",{"$f":"LaddersH!B76","v":"Colombia"},"v Runner-Up Group L"]
[null,{"$f":"Ladders!C81","v":"Incomplete"},"1L",{"$f":"LaddersH!B82","v":"Croatia"},"v Third (EHIJK)"]
[null,{"$f":"IF(Ladders!L85=\"Table OK\",Ladders!L85,\"Check Table\")","v":"Table OK"},"2L",{"$f":"LaddersH!B83","v":"Ghana"},"v Runner-Up Group K"]
[null,{"$f":"Ladders!C88","v":"Incomplete"},"3rd",{"$f":"Ladders!C89","v":"(DEN/MKD/CZE/IRL)"},"v TBD"]
[null,{"$f":"B27","v":"Incomplete"},"3rd",{"$f":"Ladders!C90","v":"Uzbekistan"},"v TBD"]
[null,{"$f":"B28","v":"Incomplete"},"3rd",{"$f":"Ladders!C91","v":"Algeria"},"v TBD"]
[null,"Incomplete","3rd",{"$f":"Ladders!C92","v":"Panama"},"v TBD"]
[null,"Incomplete","3rd",{"$f":"Ladders!C93","v":"Senegal"},"v TBD"]
[null,"Incomplete","3rd",{"$f":"Ladders!C94","v":"Canada"},"v TBD"]
[null,"Incomplete","3rd",{"$f":"Ladders!C95","v":"(UKR,SWE,POL,ALB)"},"v TBD"]
[null,"Incomplete","3rd",{"$f":"Ladders!C96","v":"(TUR,ROM,SVK,KOS)"},"v TBD"]

{"sheet":"FinalsTop","index":4,"n_rows":42,"n_cols":33,"rows_kept":42,"cut":false,"hidden":false,"merged":[]}
[null,null,null,null,null,null,null,null,null,null,null,null,null,null,null,null,null,null,null,null,null,null,null,null,null,null,null,null,null,{"$f":"McRopod!K1","v":"V1 - 221225"}]
[null,"Round of 32:  29 June to 8 July",null,null,null,null,null,"Round of 16:  5 to 8 July",null,null,null,null,null,"Quarter-Finals: 10 to 12 July",null,null,null,null,null,"Semi-Finals:  14 & 15 July",null,null,null,null,null,"Final:   20 July "]
[]
[]
[]
[]
[]
[]
[]
[]
[null,74,{"$f":"IF(Qualif!B3=\"Final Table\",Qualif!D3,\"Winner Group E\")","v":"Winner Group E"}]
[null,null,"3rd (A/B/C/D/F)",null,null,null,null,89,{"$f":"IF(D11=\"\",\"Winner G74\",IF(D12=\"\",\"Winner G74\",IF(D11>D12,C11,IF(D11<D12,C12,IF(AND(D11=D12,E11=\"Winner G74\"),\"\",IF(AND(D11=D12,E11>E12),C11,IF(AND(D11=D12,E11<E12),C12,\"Winner G74\")))))))","v":"Winner G74"}]
[null,77,{"$f":"IF(Qualif!B13=\"Final Table\",Qualif!D19,\"Winner Group I\")","v":"Winner Group I"},null,null,null,null,null,{"$f":"IF(D13=\"\",\"Winner G77\",IF(D14=\"\",\"Winner G77\",IF(D13>D14,C13,IF(D13<D14,C13,IF(AND(D13=D14,E13=\"\"),\"Winner G77\",IF(AND(D13=D14,E13>E14),C13,IF(AND(D13=D14,E13<E14),C14,\"Winner G77\")))))))","v":"Winner G77"}]
[null,null," 3rd (C/D/F/GH)",null,null,null,null,null,"Philadelphia - 4 Jul",null,null,null,null,null,{"$f":"IF(J12=\"\",\"Winner G89\",IF(J13=\"\",\"Winner G89\",IF(J12>J13,I12,IF(J12<J13,I13,IF(AND(J12=J13,K13=\"\"),\"Winner G89\",IF(AND(J12=J13,K12>K13),I12,IF(AND(J12=J13,K12<K13),I13,\"Winner G89\")))))))","v":"Winner G89"}]
[null,73,{"$f":"IF(Qualif!B3=\"Final Table\",Qualif!D4,\"Runner-Up Group A\")","v":"Runner-Up Group A"},null,null,null,null,null,null,null,null,null,null,97,"Boston - 10 Jul",null,{"$f":"IF(P16=\"\",\"\",IF(P14=P16,\"(Pens)\",\"\"))","v":""}]
[null,null,{"$f":"IF(Qualif!B5=\"Final Table\",Qualif!D6,\"Runner-Up Group B\")","v":"Runner-Up Group B"},null,null,null,null,90,{"$f":"IF(D15=\"\",\"Winner G73\",IF(D16=\"\",\"Winner G73\",IF(D15>D16,C15,IF(D15<D16,C16,IF(AND(D15=D16,E15=\"\"),\"Winner G73\",IF(AND(D15=D16,E15>E16),C15,IF(AND(D15=D16,E15<E16),C16,\"Winner G73\")))))))","v":"Winner G73"},null,null,null,null,null,{"$f":"IF(J16=\"\",\"Winner G90\",IF(J17=\"\",\"Winner G90\",IF(J16>J17,I16,IF(J16<J17,I17,IF(AND(J16=J17,K17=\"\"),\"Winner G90\",IF(AND(J16=J17,K16>K17),I16,IF(AND(J16=J17,K16<K17),I17,\"Winner G90\")))))))","v":"Winner G90"}]
[null,75,{"$f":"IF(Qualif!B11=\"Final Table\",Qualif!D13,\"Winner Group F\")","v":"Winner Group F"},null,null,null,null,null,{"$f":"IF(D17=\"\",\"Winner G75\",IF(D18=\"\",\"Winner G75\",IF(D17>D18,C17,IF(D17<D18,C18,IF(AND(D17=D18,E17=\"\"),\"Winner G75\",IF(AND(D17=D18,E17>E18),C17,IF(AND(D17=D18,E17<E18),C18,\"Winner G75\")))))))","v":"Winner G75"}]
[null,null,{"$f":"IF(Qualif!B7=\"Final Table\",Qualif!D8,\"Runner-Up Group C\")","v":"Runner-Up Group C"},null,null,null,null,null,"Houston - 4 Jul"]
[null,83,{"$f":"IF(Qualif!B23=\"Final Table\",Qualif!D24,\"Runner-Up Group K\")","v":"Runner-Up Group K"},null,null,null,null,null,null,null,null,null,null,null,null,null,null,null,null,null,{"$f":"IF(P14=\"\",\"Winner G97\",IF(P16=\"\",\"Winner G97\",IF(P14>P16,O14,IF(P14<P16,O16,IF(AND(P14=P16,Q16=\"\"),\"Winner G97\",IF(AND(P14=P16,Q14>Q16),O14,IF(AND(P14=P16,Q14<Q16),O16,\"Winner G97\")))))))","v":"Winner G97"},null,null,null,null,null,null,null,null,null,null,null,{"$f":"IF(AB38=\"\",\"\",IF(AB40=\"\",\"\",IF(AB38>AB40,AA38,IF(AB38<AB40,AA40,IF(AND(AB38=AB40,AC40=\"\"),\"\",IF(AND(AB38=AB40,AC38>AC40),AA38,IF(AND(AB38=AB40,AC38<AC40),AA40,\"There must be a winner!\")))))))","v":""}]
[null,null,{"$f":"IF(Qualif!B25=\"Final Table\",Qualif!D26,\"Runner-Up Group L\")","v":"Runner-Up Group L"},null,null,null,null,93,{"$f":"IF(D19=\"\",\"Winner G83\",IF(D20=\"\",\"Winner G83\",IF(D19>D20,C19,IF(D19<D20,C20,IF(AND(D19=D20,E19=\"\"),\"Winner G83\",IF(AND(D19=D20,E19>E20),C19,IF(AND(D19=D20,E19<E20),C20,\"Winner G83\")))))))","v":"Winner G83"},null,null,null,null,null,null,null,null,null,null,101,"Dallas - 14 Jul",null,{"$f":"IF(V21=\"\",\"\",IF(V19=V21,\"(Pens)\",\"\"))","v":""}]
[null,84,{"$f":"IF(Qualif!B17=\"Final Table\",Qualif!D17,\"Winner Group H\")","v":"Winner Group H"},null,null,null,null,null,{"$f":"IF(D21=\"\",\"Winner G84\",IF(D22=\"\",\"Winner G84\",IF(D21>D22,C21,IF(D21<D22,C22,IF(AND(D21=D22,E21=\"\"),\"Winner G84\",IF(AND(D21=D22,E21>E22),C21,IF(AND(D21=D22,E21<E22),C22,\"Winner G84\")))))))","v":"Winner G84"},null,null,null,null,null,null,null,null,null,null,null,{"$f":"IF(P22=\"\",\"Winner G98\",IF(P24=\"\",\"Winner G98\",IF(P22>P24,O22,IF(P22<P24,O24,IF(AND(P22=P24,Q24=\"\"),\"Winner G98\",IF(AND(P22=P24,Q22>Q24),O22,IF(AND(P22=P24,Q22<Q24),O24,\"Winner G98\")))))))","v":"Winner G98"}]
[null,null,{"$f":"IF(Qualif!B21=\"Final Table\",Qualif!D22,\"Runner-Up Group J\")","v":"Runner-Up Group J"},null,null,null,null,null,"Dallas - 5 Jul",null,null,null,null,null,{"$f":"IF(J20=\"\",\"Winner G93\",IF(J21=\"\",\"Winner G93\",IF(J20>J21,I20,IF(J20<J21,I21,IF(AND(J20=J21,K21=\"\"),\"Winner G93\",IF(AND(J20=J21,K20>K21),I20,IF(AND(J20=J21,K20<K21),I21,\"Winner G93\")))))))","v":"Winner G93"}]
[null,81,{"$f":"IF(Qualif!B9=\"Final Table\",Qualif!D9,\"Winner Group D\")","v":"Winner Group D"},null,null,null,null,null,null,null,null,null,null,98,"Los Angeles - 10 Jul",null,{"$f":"IF(P24=\"\",\"\",IF(P22=P24,\"(Pens)\",\"\"))","v":""}]
[null,null,"3rd (BEFIJ)",null,null,null,null,94,{"$f":"IF(D23=\"\",\"Winner G81\",IF(D24=\"\",\"Winner G81\",IF(D23>D24,C23,IF(D23<D24,C24,IF(AND(D23=D24,E23=\"\"),\"Winner G81\",IF(AND(D23=D24,E23>E24),C23,IF(AND(D23=D24,E23<E24),C24,\"Winner G81\")))))))","v":"Winner G81"},null,null,null,null,null,{"$f":"IF(J24=\"\",\"Winner G94\",IF(J25=\"\",\"Winner G94\",IF(J24>J25,I24,IF(J24<J25,I25,IF(AND(J24=J25,K25=\"\"),\"Winner G94\",IF(AND(J24=J25,K24>K25),I24,IF(AND(J24=J25,K24<K25),I25,\"Winner G94\")))))))","v":"Winner G94"}]
[null,82,{"$f":"IF(Qualif!B15=\"Final Table\",Qualif!D15,\"Winner Group G\")","v":"Winner Group G"},null,null,null,null,null,{"$f":"IF(D25=\"\",\"Winner G82\",IF(D26=\"\",\"Winner G82\",IF(D25>D26,C25,IF(D25<D26,C26,IF(AND(D25=D26,E25=\"\"),\"Winner G82\",IF(AND(D25=D26,E25>E26),C25,IF(AND(D25=D26,E25<E26),C26,\"Winner G82\")))))))","v":"Winner G82"},null,null,null,null,null,null,null,null,null,null,null,null,null,null,null,null,null,{"$f":"IF(V21=\"\",\"Winner G101\",IF(V19>V21,U19,IF(V19<V21,U21,IF(AND(V19=V21,W21=\"\"),\"Winner G101\",IF(AND(V19=V21,W19>W21),U19,IF(AND(V19=V21,W19<W21),U21,\"Winner G101\"))))))","v":"Winner G101"}]
[null,null,"3rd (AEHIJ)",null,null,null,null,null,"Seattle - 5 Jul",null,null,null,null,null,null,null,null,null,null,null,null,null,null,null,null,{"$f":"IF(AB26=\"\",\"\",\"Champions:\")","v":""},null,{"$f":"IF(AB25=\"\",\"\",IF(AB30>AB25,AA30,IF(AB30<AB25,AA25,IF(AND(AB30=AB25,AC25=\"\"),\"\",IF(AND(AB30=AB25,AC30>AC25),AA30,IF(AND(AB30=AB25,AC30<AC25),AA25,\"There must be a winner\"))))))","v":""}]
[null,76,{"$f":"IF(Qualif!B7=\"Final Table\",Qualif!D7,\"Winner Group C\")","v":"Winner Group C"},null,null,null,null,null,null,null,null,null,null,null,null,null,null,null,null,null,null,null,null,null,null,104,"New York/New Jersey - 19 Jul",null,{"$f":"IF(AB25=\"\",\"\",IF(AB30=AB25,\"(Pens)\",\"\"))","v":""}]
[null,null,{"$f":"IF(Qualif!B13=\"Final Table\",Qualif!D14,\"Runner-Up Group F\")","v":"Runner-Up Group F"},null,null,null,null,91,{"$f":"IF(D27=\"\",\"Winner G76\",IF(D28=\"\",\"Winner G76\",IF(D27>D28,C27,IF(D27<D28,C28,IF(AND(D27=D28,E27=\"\"),\"Winner G76\",IF(AND(D27=D28,E27>E28),C27,IF(AND(D27=D28,E27<E28),C28,\"Winner G76\")))))))","v":"Winner G76"}]
[null,78,{"$f":"IF(Qualif!B11=\"Final Table\",Qualif!D12,\"Runner-Up Group E\")","v":"Runner-Up Group E"},null,null,null,null,null,{"$f":"IF(D29=\"\",\"Winner G78\",IF(D30=\"\",\"Winner G78\",IF(D29>D30,C29,IF(D29<D30,C30,IF(AND(D29=D30,E29=\"\"),\"Winner G78\",IF(AND(D29=D30,E29>E30),C29,IF(AND(D29=D30,E29<E30),C30,\"Winner G78\")))))))","v":"Winner G78"},null,null,null,null,null,null,null,null,null,null,null,null,null,null,null,null,{"$f":"IF(AB29=\"\",\"\",\"Runners-Up:\")","v":""},null,{"$f":"IF(AB26=\"\",\"\",IF(AB26=AA30,AA25,AA30))","v":""}]
[null,null,{"$f":"IF(Qualif!B19=\"Final Table\",Qualif!D20,\"Runner-Up Group I\")","v":"Runner-Up Group I"},null,null,null,null,null,"New York/New Jersey - 5 Jul",null,null,null,null,null,{"$f":"IF(J28=\"\",\"Winner G91\",IF(J29=\"\",\"Winner G91\",IF(J28>J29,I28,IF(J28<J29,I29,IF(AND(J28=J29,K29=\"\"),\"Winner G91\",IF(AND(J28=J29,K28>K29),I28,IF(AND(J28=J29,K28<K29),I29,\"Winner G91\")))))))","v":"Winner G91"},null,null,null,null,null,null,null,null,null,null,null,{"$f":"IF(V36=\"\",\"Winner G102\",IF(V34>V36,U34,IF(V34<V36,U36,IF(AND(V34=V36,W36=\"\"),\"Winner G102\",IF(AND(V34=V36,W34>W36),U34,IF(AND(V34=V36,W34<W36),U36,\"Winner G102\"))))))","v":"Winner G102"}]
[null,79,{"$f":"IF(Qualif!B3=\"Final Table\",Qualif!D3,\"Winner Group A\")","v":"Winner Group A"},null,null,null,null,null,null,null,null,null,null,99,"Miami - 11 Jul",null,{"$f":"IF(P32=\"\",\"\",IF(P30=P32,\"(Pens)\",\"\"))","v":""}]
[null,null,"3rd (C/E/F/H/I)",null,null,null,null,92,{"$f":"IF(D31=\"\",\"Winner G79\",IF(D32=\"\",\"Winner G79\",IF(D31>D32,C31,IF(D31<D32,C32,IF(AND(D31=D32,E31=\"\"),\"Winner G79\",IF(AND(D31=D32,E31>E32),C31,IF(AND(D31=D32,E31<E32),C32,\"Winner G79\")))))))","v":"Winner G79"},null,null,null,null,null,{"$f":"IF(J32=\"\",\"Winner G92\",IF(J33=\"\",\"Winner G92\",IF(J32>J33,I32,IF(J32<J33,I33,IF(AND(J32=J33,K33=\"\"),\"Winner G92\",IF(AND(J32=J33,K32>K33),I32,IF(AND(J32=J33,K32<K33),I33,\"Winner G92\")))))))","v":"Winner G92"}]
[null,80,{"$f":"IF(Qualif!B25=\"Final Table\",Qualif!D25,\"Winner Group L\")","v":"Winner Group L"},null,null,null,null,null,{"$f":"IF(D33=\"\",\"Winner G80\",IF(D34=\"\",\"Winner G80\",IF(D33>D34,C33,IF(D33<D34,C34,IF(AND(D33=D34,E33=\"\"),\"Winner G80\",IF(AND(D33=D34,E33>E34),C33,IF(AND(D33=D34,E33<E34),C34,\"Winner G80\")))))))","v":"Winner G80"}]
[null,null,"3rd (EHIJK)",null,null,null,null,null,"Mexico City - 5 July",null,null,null,null,null,null,null,null,null,null,null,{"$f":"IF(P30=\"\",\"Winner G99\",IF(P32=\"\",\"Winner G99\",IF(P30>P32,O30,IF(P30<P32,O32,IF(AND(P30=P32,Q32=\"\"),\"Winner G99\",IF(AND(P30=P32,Q30>Q32),O30,IF(AND(P30=P32,Q30<Q32),O32,\"Winner G99\")))))))","v":"Winner G99"}]
[null,86,{"$f":"IF(Qualif!B21=\"Final Table\",Qualif!D21,\"Winner Group J\")","v":"Winner Group J"},null,null,null,null,null,null,null,null,null,null,null,null,null,null,null,null,102,"Atlanta - 15 Jul",null,{"$f":"IF(V36=\"\",\"\",IF(V34=V36,\"(Pens)\",\"\"))","v":""}]
[null,null,{"$f":"IF(Qualif!B17=\"Final Table\",Qualif!D18,\"Runner-Up Group H\")","v":"Runner-Up Group H"},null,null,null,null,95,{"$f":"IF(D35=\"\",\"Winner G86\",IF(D36=\"\",\"Winner G86\",IF(D35>D36,C35,IF(D35<D36,C36,IF(AND(D35=D36,E35=\"\"),\"Winner G86\",IF(AND(D35=D36,E35>E36),C35,IF(AND(D35=D36,E35<E36),C36,\"Winner G86\")))))))","v":"Winner G86"},null,null,null,null,null,null,null,null,null,null,null,{"$f":"IF(P38=\"\",\"Winner G100\",IF(P40=\"\",\"Winner G100\",IF(P38>P40,O38,IF(P38<P40,O40,IF(AND(P38=P40,Q40=\"\"),\"Winner G100\",IF(AND(P38=P40,Q38>Q40),O38,IF(AND(P38=P40,Q38<Q40),O40,\"Winner G100\")))))))","v":"Winner G100"}]
[null,88,{"$f":"IF(Qualif!B9=\"Final Table\",Qualif!D10,\"Runner-Up Group D\")","v":"Runner-Up Group D"},null,null,null,null,null,{"$f":"IF(D37=\"\",\"Winner G88\",IF(D38=\"\",\"Winner G88\",IF(D37>D38,C37,IF(D37<D38,C38,IF(AND(D37=D38,E37=\"\"),\"Winner G88\",IF(AND(D37=D38,E37>E38),C37,IF(AND(D37=D38,E37<E38),C38,\"Winner G88\")))))))","v":"Winner G88"},null,null,null,null,null,null,null,null,null,null,null,null,null,null,null,null,"Third-Place Play-Off - 19 July"]
[null,null,{"$f":"IF(Qualif!B15=\"Final Table\",Qualif!D16,\"Runner-Up Group G\")","v":"Runner-Up Group G"},null,null,null,null,null,"Atlanta - 7 Jul",null,null,null,null,null,{"$f":"IF(J36=\"\",\"Winner G95\",IF(J37=\"\",\"Winner G95\",IF(J36>J37,I36,IF(J36<J37,I37,IF(AND(J36=J37,K37=\"\"),\"Winner G95\",IF(AND(J36=J37,K36>K37),I36,IF(AND(J36=J37,K36<K37),I37,\"Winner G95\")))))))","v":"Winner G95"},null,null,null,null,null,null,null,null,null,null,null,{"$f":"IF(AA30=\"\",\"Loser G101\",IF(AA30=U34,U36,U34))","v":"Winner G99"}]
[null,85,{"$f":"IF(Qualif!B5=\"Final Table\",Qualif!D5,\"Winner Group B\")","v":"Winner Group B"},null,null,null,null,null,null,null,null,null,null,100,"Kansas City - 11 Jul",null,{"$f":"IF(P40=\"\",\"\",IF(P38=P40,\"(Pens)\",\"\"))","v":""},null,null,null,null,null,null,null,null,103,"Miami - 18 Jul"]
[null,null,"3rd (EFGIJ)",null,null,null,null,96,{"$f":"IF(D39=\"\",\"Winner G85\",IF(D40=\"\",\"Winner G85\",IF(D39>D40,C39,IF(D39<D40,C40,IF(AND(D39=D40,E39=\"\"),\"Winner G85\",IF(AND(D39=D40,E39>E40),C39,IF(AND(D39=D40,E39<E40),C40,\"Winner G85\")))))))","v":"Winner G85"},null,null,null,null,null,{"$f":"IF(J40=\"\",\"Winner G96\",IF(J41=\"\",\"Winner G96\",IF(J40>J41,I40,IF(J40<J41,I41,IF(AND(J40=J41,K41=\"\"),\"Winner G96\",IF(AND(J40=J41,K40>K41),I40,IF(AND(J40=J41,K40<K41),I41,\"Winner G96\")))))))","v":"Winner G96"},null,null,null,null,null,null,null,null,null,null,null,{"$f":"IF(AA25=\"\",\"Winner G102\",IF(AA25=U19,U21,U19))","v":"Winner G97"}]
[null,87,{"$f":"IF(Qualif!B23=\"Final Table\",Qualif!D23,\"Winner Group K\")","v":"Winner Group K"},null,null,null,null,null,{"$f":"IF(D41=\"\",\"Winner G87\",IF(D42=\"\",\"Winner G87\",IF(D41>D42,C41,IF(D41<D42,C42,IF(AND(D41=D42,E41=\"\"),\"Winner G87\",IF(AND(D41=D42,E41>E42),C41,IF(AND(D41=D42,E41<E42),C42,\"Winner G87\")))))))","v":"Winner G87"}]
[null,null,"3rd (DEIJL)",null,null,null,null,null,"Vancouver - 7 Jul"]

{"sheet":"McRopod","index":5,"n_rows":114,"n_cols":11,"rows_kept":114,"cut":false,"hidden":false,"merged":[]}
[null,null,null,null,null,null,null,null,null,null,"V1 - 221225"]
[]
[]
[null,"Welcome to McRopod Concepts' FIFA World Cup 2026 Sports System."]
[]
[null,"I'm sure you'll have fun with this.  Use it to predict what will happen, and use it to keep tabs with what does happen."]
[null,"By entering a result - actual or predicted - everything else is calculated for you: which teams qualify"]
[null,"and which depart, which teams advance, which go home, and which teams get the FIFA medals."]
[]
[null,"Before you do anything else - let's maximise the image!  Go to <View>, then select <Full Screen>.  If you want"]
[null,"to return to your normal screen layout afterwards, 'all you have to do is select <View>, and then <Full Screen> again."]
[]
[]
[null,"Instructions for use"]
[]
[null,"First Stage - Group Fixtures"]
[]
[null,"Go to the <First Stage> page.  There you’ll see all of the fixtures comprising the Group phase."]
[]
[null,"The fixtures are shown by Group.  You’ll need to scroll down to see all the Groups’ fixtures."]
[]
[null,"There are spaces for you to input the scores of a fixture.  You’ll need to make sure that only a whole positive number"]
[null,"or a blank appears in these cells.  If anything else appears you'll get an error flag in the system: <######> for example."]
[]
[null,"If ever this happens, check to make sure that you have not input something other than a whole positive number"]
[null,"or a blank.  If it’s not clear where you have input something else into a Group’s results cells, delete that Group’s"]
[null,"results and start again. "]
[]
[null,"Sorting the Group Tables"]
[]
[null,"After inputting the results of a Group, press the <Sort> button for that Group.  You’ll instantly be taken to that"]
[null,"Group’s Table, which will be correctly sorted. "]
[]
[null,"You can go back to the <First Stage> page by pressing the button at the top of the <Ladders> page."]
[]
[null,"You can re-order a Group Table when Points, Goal Difference, and Goals For are equal between two or"]
[null,"more teams, and the Table sort is not the way FIFA has it."]
[]
[null,"In most cases these three criteria will separate teams into their correct order.  However where they are equal,"]
[null,"and where a fourth or subsequent criterion comes into play, the McRopod Concepts' WC 2026 Sport System’s"]
[null,"standard automatic sort function is unable to take that into account."]
[]
[null,"Eventually, it may even come down to a ballot between the sides.  Whichever way is used to split any"]
[null,"teams equal on these three criteria, the McRopod Sports System will be able to ensure your Tables take this into"]
[null,"account."]
[]
[null,"Because all of these can’t be loaded into the McRopod Concepts' WC 2022 Sports System without asking"]
[null,"you to keep track of far too much detail, the system:"]
[null,"·    flags whenever there are two teams in a Group with exactly the same record,"]
[null,"·    lets you know which teams these are, and"]
[null,"·    asks if you want to swap their order."]
[]
[null,"There are three buttons in the far right column of each Group Table, headed <Swap?>.  The buttons are"]
[null,"labelled < 2 > 1 >, < 3 > 2 >, and < 4 > 3 > respectively.  When you press < 2 > 1 >, the team ranked second"]
[null,"swaps places with the first ranked team."]
[]
[null,"A message appears letting you know whenever such a tie has occurred, which positions are affected,"]
[null,"and inviting you to swap these two teams.  You will only need to swap when the Group Table ranking"]
[null,"is incorrect because of the fourth or subsequent criteria."]
[]
[null,"If you see a <No> under the <Swap?> heading in a Group Table, the Table is correct and should be left"]
[null,"as it is.  Although you could re-arrange the Group rankings by doing this swap,  if you do, it’ll be out of order."]
[null,"You can correct it by pressing the <Sort> button for that Group."]
[]
[null,"After all the games of a Group have been played, that Group Table lets you know it is the Final Table."]
[]
[null,"Until each of the Group Tables are finalised, the elimination phase games are not confirmed."]
[]
[null,"The Second Stage - Elimination Round"]
[]
[null,"Thirty-two of the 48 teams advance to the Second Phase - an elimination series.  The Group winners and runners-up"]
[null,"qualify, along with the eight highest-ranked third-placed teams in the Groups."]
[]
[null,"You can sort the Third-placed teams' rankings at any time, by using the <Sort> button on the Thirds Table."]
[]
[null,"Once a Group’s games have all been played, and subject only to any swapping needed to separate tied teams"]
[null,"on the fourth criterion, those teams from that Group which are confirmed as having advanced to the Second Stage"]
[null,"can be seen on the <Qualified> page.  You can get there from any other page by pressing the <Qualified> button."]
[]
[null,"The Second Stage matches can be seen by pressing the <2nd Stage> button. "]
[]
[null,"You will need to enter the eight teams which have come through the best Thirds path in the appropriate"]
[null,"yellow cells in the Round of 32 on this page.  Once you've done that, everyhting else happens based only on"]
[null,"the scores you input."]
[]
[null,"When you enter a full-time score (or full-time plus where extra-time has been played)"]
[null,"in the first set of yellow results cells, the McRopod Concepts' WC 2026 Sports System detects if "]
[null,"there has been a winner and advances that team to the next round."]
[null,"  "]
[null,"If you input a score that means the match is a draw, the match is then determined on a penalty shoot-out."]
[null,"The second set of yellow cells is for the penalties.  As there must be a winner this way, one team has to advance."]
[]
[null,"By progressively entering scores in the Elimination tree, you’ll get to the Final."]
[]
[null,"There are spaces for you to input the scores of a fixture.  You’ll need to make sure that only a whole positive number"]
[null,"or a blank appears in these cells.  If anything else appears you'll get an error flag in the system: <######> for example."]
[]
[null,"If ever this happens, check to make sure that you have not input something other than a whole positive number"]
[null,"or a blank."]
[null,""]
[null,"OK?  So head on off now to the <First Stage> Group Fixtures page, and get cracking :-)"]
[]
[null,"Need a Sports System for a League you are running?"]
[]
[null,"McRopod Concepts can design a Sports System for a League you are running, or a tournament you organise."]
[null,"McRopod Concepts can also design a Sports System for a League or Tournament you are following.  "]
[]
[null,"If you'd like to have a Sports System designed, email <mcropod@mcropod.com.au>."]
[]
[]
[]
[]
[null,"Alan Clark"]
[null,"McRopod Concepts"]

{"sheet":"Times","index":7,"n_rows":57,"n_cols":15,"rows_kept":57,"cut":false,"hidden":true,"merged":[]}
[null,null,null,null,null,"02:00:00","00:30:00","07:00:00","Display"]
[null,"Local",null,null,"Local Russia","West Oz","Central Oz","East Oz","East Oz"]
["2018-06-14","18:00:00",{"$f":"A3","v":43265},{"$f":"B3","v":0.75},{"$f":"(C3+D3)","v":"2018-06-14T18:00:00"},{"$f":"H3-$F$1","v":"2018-06-14T23:00:00"},{"$f":"H3-$G$1","v":"2018-06-15T00:30:00"},"2018-06-15T01:00:00","2018-06-15T01:00:00","A1","v","A2",null,{"$f":"Fixtures!G3","v":"Mexico"},{"$f":"Fixtures!I3","v":"South Africa"}]
["2018-06-15","17:00:00",{"$f":"A4","v":43266},{"$f":"B4","v":0.70833333333333337},{"$f":"(C4+D4)","v":"2018-06-15T17:00:00"},{"$f":"H4-$F$1","v":"2018-06-15T20:00:00"},{"$f":"H4-$G$1","v":"2018-06-15T21:30:00"},"2018-06-15T22:00:00","2018-06-15T22:00:00","A3","v","A4",null,{"$f":"Fixtures!G4","v":"South Korea"},{"$f":"Fixtures!I4","v":"(DEN/MKD/CZE/IRL)"}]
["2018-06-19","21:00:00",43270,0.875,"2018-06-19T21:00:00","2018-06-20T02:00:00","2018-06-20T03:30:00","2018-06-20T04:00:00","2018-06-20T04:00:00",{"$f":"J3","v":"A1"},"v",{"$f":"J4","v":"A3"},null,{"$f":"Fixtures!G5","v":"(DEN/MKD/CZE/IRL)"},{"$f":"Fixtures!I5","v":"South Africa"}]
["2018-06-20","18:00:00",43271,0.75,"2018-06-20T18:00:00","2018-06-20T23:00:00","2018-06-21T00:30:00","2018-06-21T01:00:00","2018-06-21T01:00:00",{"$f":"L4","v":"A4"},"v",{"$f":"L3","v":"A2"},null,{"$f":"Fixtures!G6","v":"Mexico"},{"$f":"Fixtures!I6","v":"South Korea"}]
["2018-06-25","17:00:00",43276,0.70833333333333337,"2018-06-25T17:00:00","2018-06-25T22:00:00","2018-06-25T23:30:00","2018-06-26","2018-06-26",{"$f":"L3","v":"A2"},"v",{"$f":"J4","v":"A3"},null,{"$f":"Fixtures!G7","v":"(DEN/MKD/CZE/IRL)"},{"$f":"Fixtures!I7","v":"Mexico"}]
["2018-06-25","18:00:00",43276,0.75,"2018-06-25T18:00:00","2018-06-25T22:00:00","2018-06-25T23:30:00","2018-06-26","2018-06-26",{"$f":"L4","v":"A4"},"v",{"$f":"J3","v":"A1"},null,{"$f":"Fixtures!G8","v":"South Africa"},{"$f":"Fixtures!I8","v":"South Korea"}]
[]
["2018-06-15","18:00:00",43266,0.75,"2018-06-15T18:00:00","2018-06-15T23:00:00","2018-06-16T00:30:00","2018-06-16T01:00:00","2018-06-16T01:00:00","B1","v","B2",null,{"$f":"Fixtures!G10","v":"Canada"},{"$f":"Fixtures!I10","v":"(ITA,NRL,WAL,BIH)"}]
["2018-06-15","21:00:00",43266,0.875,"2018-06-15T21:00:00","2018-06-16T02:00:00","2018-06-16T03:30:00","2018-06-16T04:00:00","2018-06-16T04:00:00","B3","v","B4",null,{"$f":"Fixtures!G11","v":"Qatar"},{"$f":"Fixtures!I11","v":"Switzerland"}]
["2018-06-20","15:00:00",43271,0.625,"2018-06-20T15:00:00","2018-06-20T20:00:00","2018-06-20T21:30:00","2018-06-20T22:00:00","2018-06-20T22:00:00",{"$f":"J10","v":"B1"},"v",{"$f":"J11","v":"B3"},null,{"$f":"Fixtures!G12","v":"Switzerland"},{"$f":"Fixtures!I12","v":"(ITA,NRL,WAL,BIH)"}]
["2018-06-20","21:00:00",43271,0.875,"2018-06-20T21:00:00","2018-06-21T02:00:00","2018-06-21T03:30:00","2018-06-21T04:00:00","2018-06-21T04:00:00",{"$f":"L11","v":"B4"},"v",{"$f":"L10","v":"B2"},null,{"$f":"Fixtures!G13","v":"Canada"},{"$f":"Fixtures!I13","v":"Qatar"}]
["2018-06-25","20:00:00",43276,0.83333333333333337,"2018-06-25T20:00:00","2018-06-26T02:00:00","2018-06-26T03:30:00","2018-06-26T04:00:00","2018-06-26T04:00:00",{"$f":"L10","v":"B2"},"v",{"$f":"J11","v":"B3"},null,{"$f":"Fixtures!G14","v":"Switzerland"},{"$f":"Fixtures!I14","v":"Canada"}]
["2018-06-25","21:00:00",43276,0.875,"2018-06-25T21:00:00","2018-06-26T02:00:00","2018-06-26T03:30:00","2018-06-26T04:00:00","2018-06-26T04:00:00",{"$f":"L11","v":"B4"},"v",{"$f":"J10","v":"B1"},null,{"$f":"Fixtures!G15","v":"(ITA,NRL,WAL,BIH)"},{"$f":"Fixtures!I15","v":"Qatar"}]
[]
["2018-06-16","13:00:00",43267,0.54166666666666663,"2018-06-16T13:00:00","2018-06-16T18:00:00","2018-06-16T19:30:00","2018-06-16T20:00:00","2018-06-16T20:00:00","C1","v","C2",null,{"$f":"Fixtures!G17","v":"Brazil"},{"$f":"Fixtures!I17","v":"Morocco"}]
["2018-06-16","19:00:00",43267,0.79166666666666663,"2018-06-16T19:00:00","2018-06-17","2018-06-17T01:30:00","2018-06-17T02:00:00","2018-06-17T02:00:00","C3","v","C4",null,{"$f":"Fixtures!G18","v":"Haiti"},{"$f":"Fixtures!I18","v":"Scotland"}]
["2018-06-21","20:00:00",43272,0.83333333333333337,"2018-06-21T20:00:00","2018-06-21T23:00:00","2018-06-22T00:30:00","2018-06-22T01:00:00","2018-06-22T01:00:00",{"$f":"J17","v":"C1"},"v",{"$f":"J18","v":"C3"},null,{"$f":"Fixtures!G19","v":"Scotland"},{"$f":"Fixtures!I19","v":"Morocco"}]
["2018-06-21","16:00:00",43272,0.66666666666666663,"2018-06-21T16:00:00","2018-06-21T20:00:00","2018-06-21T21:30:00","2018-06-21T22:00:00","2018-06-21T22:00:00",{"$f":"L18","v":"C4"},"v",{"$f":"L17","v":"C2"},null,{"$f":"Fixtures!G20","v":"Brazil"},{"$f":"Fixtures!I20","v":"Haiti"}]
["2018-06-26","17:00:00",43277,0.70833333333333337,"2018-06-26T17:00:00","2018-06-26T22:00:00","2018-06-26T23:30:00","2018-06-27","2018-06-27",{"$f":"L17","v":"C2"},"v",{"$f":"J18","v":"C3"},null,{"$f":"Fixtures!G21","v":"Scotland"},{"$f":"Fixtures!I21","v":"Brazil"}]
["2018-06-26","17:00:00",43277,0.70833333333333337,"2018-06-26T17:00:00","2018-06-26T22:00:00","2018-06-26T23:30:00","2018-06-27","2018-06-27",{"$f":"L18","v":"C4"},"v",{"$f":"J17","v":"C1"},null,{"$f":"Fixtures!G22","v":"Morocco"},{"$f":"Fixtures!I22","v":"Haiti"}]
[]
["2018-06-16","16:00:00",43267,0.66666666666666663,"2018-06-16T16:00:00","2018-06-16T21:00:00","2018-06-16T22:30:00","2018-06-16T23:00:00","2018-06-16T23:00:00","D1","v","D2",null,{"$f":"Fixtures!G24","v":"USA"},{"$f":"Fixtures!I24","v":"Paraguay"}]
["2018-06-16","21:00:00",43267,0.875,"2018-06-16T21:00:00","2018-06-17T02:00:00","2018-06-17T03:30:00","2018-06-17T04:00:00","2018-06-17T04:00:00","D3","v","D4",null,{"$f":"Fixtures!G25","v":"Australia"},{"$f":"Fixtures!I25","v":"(TUR,ROM,SVK,KOS)"}]
["2018-06-21","21:00:00",43272,0.875,"2018-06-21T21:00:00","2018-06-22T02:00:00","2018-06-22T03:30:00","2018-06-22T04:00:00","2018-06-22T04:00:00",{"$f":"J24","v":"D1"},"v",{"$f":"J25","v":"D3"},null,{"$f":"Fixtures!G26","v":"USA"},{"$f":"Fixtures!I26","v":"Australia"}]
["2018-06-22","18:00:00",43273,0.75,"2018-06-22T18:00:00","2018-06-22T23:00:00","2018-06-23T00:30:00","2018-06-23T01:00:00","2018-06-23T01:00:00",{"$f":"L25","v":"D4"},"v",{"$f":"L24","v":"D2"},null,{"$f":"Fixtures!G27","v":"(TUR,ROM,SVK,KOS)"},{"$f":"Fixtures!I27","v":"Paraguay"}]
["2018-06-26","21:00:00",43277,0.875,"2018-06-26T21:00:00","2018-06-27T02:00:00","2018-06-27T03:30:00","2018-06-27T04:00:00","2018-06-27T04:00:00",{"$f":"L24","v":"D2"},"v",{"$f":"J25","v":"D3"},null,{"$f":"Fixtures!G28","v":"(TUR,ROM,SVK,KOS)"},{"$f":"Fixtures!I28","v":"USA"}]
["2018-06-26","21:00:00",43277,0.875,"2018-06-26T21:00:00","2018-06-27T02:00:00","2018-06-27T03:30:00","2018-06-27T04:00:00","2018-06-27T04:00:00",{"$f":"L25","v":"D4"},"v",{"$f":"J24","v":"D1"},null,{"$f":"Fixtures!G29","v":"Paraguay"},{"$f":"Fixtures!I29","v":"Australia"}]
[]
["2018-06-17","16:00:00",43268,0.66666666666666663,{"$f":"(C31+D31)","v":"2018-06-17T16:00:00"},"2018-06-17T20:00:00","2018-06-17T21:30:00","2018-06-17T22:00:00","2018-06-17T22:00:00","E1","v","E2",null,{"$f":"Fixtures!G31","v":"Germany"},{"$f":"Fixtures!I31","v":"Curaçao"}]
["2018-06-17","21:00:00",43268,0.875,"2018-06-17T21:00:00","2018-06-18T02:00:00","2018-06-18T03:30:00","2018-06-18T04:00:00","2018-06-18T04:00:00","E3","v","E4",null,{"$f":"Fixtures!G32","v":"Côte d'Ivoire"},{"$f":"Fixtures!I32","v":"Ecuador"}]
["2018-06-22","15:00:00",43273,0.625,"2018-06-22T15:00:00","2018-06-22T20:00:00","2018-06-22T21:30:00","2018-06-22T22:00:00","2018-06-22T22:00:00",{"$f":"J31","v":"E1"},"v",{"$f":"J32","v":"E3"},null,{"$f":"Fixtures!G33","v":"Germany"},{"$f":"Fixtures!I33","v":"Côte d'Ivoire"}]
["2018-06-22","20:00:00",43273,0.83333333333333337,"2018-06-22T20:00:00","2018-06-23T02:00:00","2018-06-23T03:30:00","2018-06-23T04:00:00","2018-06-23T04:00:00",{"$f":"L32","v":"E4"},"v",{"$f":"L31","v":"E2"},null,{"$f":"Fixtures!G34","v":"Ecuador"},{"$f":"Fixtures!I34","v":"Curaçao"}]
["2018-06-27","21:00:00",43278,0.875,"2018-06-27T21:00:00","2018-06-28T02:00:00","2018-06-28T03:30:00","2018-06-28T04:00:00","2018-06-28T04:00:00",{"$f":"L31","v":"E2"},"v",{"$f":"J32","v":"E3"},null,{"$f":"Fixtures!G35","v":"Curaçao"},{"$f":"Fixtures!I35","v":"Côte d'Ivoire"}]
["2018-06-27","21:00:00",43278,0.875,"2018-06-27T21:00:00","2018-06-28T02:00:00","2018-06-28T03:30:00","2018-06-28T04:00:00","2018-06-28T04:00:00",{"$f":"L32","v":"E4"},"v",{"$f":"J31","v":"E1"},null,{"$f":"Fixtures!G36","v":"Ecuador"},{"$f":"Fixtures!I36","v":"Germany"}]
[]
["2018-06-17","18:00:00",43268,0.75,"2018-06-17T18:00:00","2018-06-17T23:00:00","2018-06-18T00:30:00","2018-06-18T01:00:00","2018-06-18T01:00:00","F1","v","F2",null,{"$f":"Fixtures!G38","v":"Netherlands"},{"$f":"Fixtures!I38","v":"Japan"}]
["2018-06-18","15:00:00",43269,0.625,"2018-06-18T15:00:00","2018-06-18T20:00:00","2018-06-18T21:30:00","2018-06-18T22:00:00","2018-06-18T22:00:00","F3","v","F4",null,{"$f":"Fixtures!G39","v":"(UKR,SWE,POL,ALB)"},{"$f":"Fixtures!I39","v":"Tunisia"}]
["2018-06-23","21:00:00",43274,0.875,"2018-06-23T21:00:00","2018-06-24T02:00:00","2018-06-24T03:30:00","2018-06-24T04:00:00","2018-06-24T04:00:00",{"$f":"J38","v":"F1"},"v",{"$f":"J39","v":"F3"},null,{"$f":"Fixtures!G40","v":"Netherlands"},{"$f":"Fixtures!I40","v":"(UKR,SWE,POL,ALB)"}]
["2018-06-23","18:00:00",43274,0.75,"2018-06-23T18:00:00","2018-06-23T23:00:00","2018-06-24T00:30:00","2018-06-24T01:00:00","2018-06-24T01:00:00",{"$f":"L39","v":"F4"},"v",{"$f":"L38","v":"F2"},null,{"$f":"Fixtures!G41","v":"Tunisia"},{"$f":"Fixtures!I41","v":"Japan"}]
["2018-06-27","17:00:00",43278,0.70833333333333337,"2018-06-27T17:00:00","2018-06-27T22:00:00","2018-06-27T23:30:00","2018-06-28","2018-06-28",{"$f":"L38","v":"F2"},"v",{"$f":"J39","v":"F3"},null,{"$f":"Fixtures!G42","v":"Japan"},{"$f":"Fixtures!I42","v":"(UKR,SWE,POL,ALB)"}]
["2018-06-27","19:00:00",43278,0.79166666666666663,"2018-06-27T19:00:00","2018-06-27T22:00:00","2018-06-27T23:30:00","2018-06-28","2018-06-28",{"$f":"L39","v":"F4"},"v",{"$f":"J38","v":"F1"},null,{"$f":"Fixtures!G43","v":"Tunisia"},{"$f":"Fixtures!I43","v":"Netherlands"}]
[]
["2018-06-18","18:00:00",43269,0.75,"2018-06-18T18:00:00","2018-06-18T23:00:00","2018-06-19T00:30:00","2018-06-19T01:00:00","2018-06-19T01:00:00","G1","v","G2",null,{"$f":"Fixtures!G45","v":"Belgium"},{"$f":"Fixtures!I45","v":"Egypt"}]
["2018-06-18","21:00:00",43269,0.875,"2018-06-18T21:00:00","2018-06-19T02:00:00","2018-06-19T03:30:00","2018-06-19T04:00:00","2018-06-19T04:00:00","G3","v","G4",null,{"$f":"Fixtures!G46","v":"Iran"},{"$f":"Fixtures!I46","v":"NewZealand"}]
["2018-06-23","15:00:00",43274,0.625,"2018-06-23T15:00:00","2018-06-23T20:00:00","2018-06-23T21:30:00","2018-06-23T22:00:00","2018-06-23T22:00:00",{"$f":"J45","v":"G1"},"v",{"$f":"J46","v":"G3"},null,{"$f":"Fixtures!G47","v":"Belgium"},{"$f":"Fixtures!I47","v":"Iran"}]
["2018-06-24","15:00:00",43275,0.625,"2018-06-24T15:00:00","2018-06-24T20:00:00","2018-06-24T21:30:00","2018-06-24T22:00:00","2018-06-24T22:00:00",{"$f":"L46","v":"G4"},"v",{"$f":"L45","v":"G2"},null,{"$f":"Fixtures!G48","v":"New Zealand"},{"$f":"Fixtures!I48","v":"Egypt"}]
["2018-06-28","20:00:00",43279,0.83333333333333337,"2018-06-28T20:00:00","2018-06-29T02:00:00","2018-06-29T03:30:00","2018-06-29T04:00:00","2018-06-29T04:00:00",{"$f":"L45","v":"G2"},"v",{"$f":"J46","v":"G3"},null,{"$f":"Fixtures!G49","v":"Egypt"},{"$f":"Fixtures!I49","v":"Iran"}]
["2018-06-28","21:00:00",43279,0.875,"2018-06-28T21:00:00","2018-06-29T02:00:00","2018-06-29T03:30:00","2018-06-29T04:00:00","2018-06-29T04:00:00",{"$f":"L46","v":"G4"},"v",{"$f":"J45","v":"G1"},null,{"$f":"Fixtures!G50","v":"New Zealand"},{"$f":"Fixtures!I50","v":"Belgium"}]
[]
["2018-06-19","15:00:00",43270,0.625,"2018-06-19T15:00:00","2018-06-19T23:00:00","2018-06-20T00:30:00","2018-06-20T01:00:00","2018-06-20T01:00:00","H1","v","H2",null,{"$f":"Fixtures!G52","v":"Spain"},{"$f":"Fixtures!I52","v":"Cape Verde"}]
["2018-06-19","18:00:00",43270,0.75,"2018-06-19T18:00:00","2018-06-19T20:00:00","2018-06-19T21:30:00","2018-06-19T22:00:00","2018-06-19T22:00:00","H3","v","H4",null,{"$f":"Fixtures!G53","v":"Saudi Arabia"},{"$f":"Fixtures!I53","v":"Uruguay"}]
["2018-06-24","20:00:00",43275,0.83333333333333337,"2018-06-24T20:00:00","2018-06-24T23:00:00","2018-06-25T00:30:00","2018-06-25T01:00:00","2018-06-25T01:00:00",{"$f":"J52","v":"H1"},"v",{"$f":"J53","v":"H3"},null,{"$f":"Fixtures!G54","v":"Spain"},{"$f":"Fixtures!I54","v":"Saudi Arabia"}]
["2018-06-24","21:00:00",43275,0.875,"2018-06-24T21:00:00","2018-06-25T02:00:00","2018-06-25T03:30:00","2018-06-25T04:00:00","2018-06-25T04:00:00",{"$f":"L53","v":"H4"},"v",{"$f":"L52","v":"H2"},null,{"$f":"Fixtures!G55","v":"Uruguay"},{"$f":"Fixtures!I55","v":"Cape Verde"}]
["2018-06-28","17:00:00",43279,0.70833333333333337,"2018-06-28T17:00:00","2018-06-28T22:00:00","2018-06-28T23:30:00","2018-06-29","2018-06-29",{"$f":"L52","v":"H2"},"v",{"$f":"J53","v":"H3"},null,{"$f":"Fixtures!G56","v":"Uruguay"},{"$f":"Fixtures!I56","v":"Spain"}]
["2018-06-28","18:00:00",43279,0.75,"2018-06-28T18:00:00","2018-06-28T22:00:00","2018-06-28T23:30:00","2018-06-29","2018-06-29",{"$f":"L53","v":"H4"},"v",{"$f":"J52","v":"H1"},null,{"$f":"Fixtures!G57","v":"Cape Verde"},{"$f":"Fixtures!I57","v":"Saudi Arabia"}]

{"sheet":"LaddersH","index":8,"n_rows":119,"n_cols":17,"rows_kept":119,"cut":false,"hidden":false,"merged":[]}
[]
[]
[]
[null,{"$f":"Grid!$B$2","v":"Incomplete"},{"$f":"Grid!$P$2","v":"P"},{"$f":"Grid!$Q$2","v":"W"},{"$f":"Grid!$R$2","v":"D"},{"$f":"Grid!$S$2","v":"L"},{"$f":"Grid!$T$2","v":"F"},{"$f":"Grid!$U$2","v":"A"},{"$f":"Grid!$V$2","v":"GD"},{"$f":"Grid!$W$2","v":"Pts"},"Pre","Post"]
[null,{"$f":"Grid!$B$3","v":"South Korea"},{"$f":"Grid!$P$3","v":0},{"$f":"Grid!$Q$3","v":0},{"$f":"Grid!$R$3","v":0},{"$f":"Grid!$S$3","v":0},{"$f":"Grid!$T$3","v":0},{"$f":"Grid!$U$3","v":0},{"$f":"Grid!$V$3","v":0},{"$f":"Grid!$W$3","v":0},1,1,{"$f":"IF(J6>J5,1,IF(J7>J5,1,IF(J8>J5,1,IF(J7>J6,1,IF(J8>J6,1,IF(J8>J7,1,0))))))","v":0},{"$f":"IF(AND(J5=J6,I5=I6),1,0)","v":1},{"$f":"IF(AND(N5=1,G5=G6),1,0)","v":1},{"$f":"IF(SUM(N5+O5)=2,1,0)","v":1},{"$f":"IF(P5=2,\"1>2 ?\",\"\")","v":""}]
[null,{"$f":"Grid!$B$5","v":"Mexico"},{"$f":"Grid!$P$5","v":0},{"$f":"Grid!$Q$5","v":0},{"$f":"Grid!$R$5","v":0},{"$f":"Grid!$S$5","v":0},{"$f":"Grid!$T$5","v":0},{"$f":"Grid!$U$5","v":0},{"$f":"Grid!$V$5","v":0},{"$f":"Grid!$W$5","v":0},2,2,{"$f":"IF(AND(J6=J5,I6>I5),1,IF(AND(J7=J5,I7>I5),1,IF(AND(J8=J5,I8>I5),1,IF(AND(J7=J6,I7>I6),1,IF(AND(J8=J6,I8>I6),1,IF(AND(J8=J7,I8>I7),1,0))))))","v":0},{"$f":"IF(AND(J6=J7,I6=I7),1,0)","v":1},{"$f":"IF(AND(N6=1,G6=G7),1,0)","v":1},{"$f":"IF(SUM(N6+O6)=2,1,0)","v":1},{"$f":"IF(P6=2,\"2>3 ?\",\"\")","v":""}]
[null,{"$f":"Grid!$B$4","v":"(DEN/MKD/CZE/IRL)"},{"$f":"Grid!$P$4","v":0},{"$f":"Grid!$Q$4","v":0},{"$f":"Grid!$R$4","v":0},{"$f":"Grid!$S$4","v":0},{"$f":"Grid!$T$4","v":0},{"$f":"Grid!$U$4","v":0},{"$f":"Grid!$V$4","v":0},{"$f":"Grid!$W$4","v":0},3,3,null,{"$f":"IF(AND(J7=J8,I7=I8),1,0)","v":1},{"$f":"IF(AND(N7=1,G7=G8),1,0)","v":1},{"$f":"IF(SUM(N7+O7)=2,1,0)","v":1},{"$f":"IF(P7=2,\"3>4 ?\",\"\")","v":""}]
[null,{"$f":"Grid!$B$6","v":"South Africa"},{"$f":"Grid!$P$6","v":0},{"$f":"Grid!$Q$6","v":0},{"$f":"Grid!$R$6","v":0},{"$f":"Grid!$S$6","v":0},{"$f":"Grid!$T$6","v":0},{"$f":"Grid!$U$6","v":0},{"$f":"Grid!$V$6","v":0},{"$f":"Grid!$W$6","v":0},4,4,null,null,null,null,{"$f":"IF(SUM(C5:C8)=0,\"Table OK\",IF(M9=\"Sort Table\",\"Sort Table\",IF(SUM(P5:P7)=0,\"Table OK\",\"Swap?\")))","v":"Table OK"}]
[null,null,null,null,null,null,null,null,null,null,null,null,{"$f":"IF(SUM(M5:M8)=0,\"\",\"Sort Table\")","v":""}]
[]
[null,{"$f":"Grid!$B$9","v":"Incomplete"},{"$f":"Grid!$P$9","v":"P"},{"$f":"Grid!$Q$9","v":"W"},{"$f":"Grid!$R$9","v":"D"},{"$f":"Grid!$S$9","v":"L"},{"$f":"Grid!$T$9","v":"F"},{"$f":"Grid!$U$9","v":"A"},{"$f":"Grid!$V$9","v":"GD"},{"$f":"Grid!$W$9","v":"Pts"},"Pre","Post"]
[null,{"$f":"Grid!$B$13","v":"(ITA,NRL,WAL,BIH)"},{"$f":"Grid!$P$13","v":0},{"$f":"Grid!$Q$13","v":0},{"$f":"Grid!$R$13","v":0},{"$f":"Grid!$S$13","v":0},{"$f":"Grid!$T$13","v":0},{"$f":"Grid!$U$13","v":0},{"$f":"Grid!$V$13","v":0},{"$f":"Grid!$W$13","v":0},1,1,{"$f":"IF(J13>J12,1,IF(J14>J12,1,IF(J15>J12,1,IF(J14>J13,1,IF(J15>J13,1,IF(J15>J14,1,0))))))","v":0},{"$f":"IF(AND(J12=J13,I12=I13),1,0)","v":1},{"$f":"IF(AND(N12=1,G12=G13),1,0)","v":1},{"$f":"IF(SUM(N12+O12)=2,1,0)","v":1},{"$f":"IF(P12=2,\"1>2 ?\",\"\")","v":""}]
[null,{"$f":"Grid!$B$12","v":"Switzerland"},{"$f":"Grid!$P$12","v":0},{"$f":"Grid!$Q$12","v":0},{"$f":"Grid!$R$12","v":0},{"$f":"Grid!$S$12","v":0},{"$f":"Grid!$T$12","v":0},{"$f":"Grid!$U$12","v":0},{"$f":"Grid!$V$12","v":0},{"$f":"Grid!$W$12","v":0},2,2,{"$f":"IF(AND(J13=J12,I13>I12),1,IF(AND(J14=J12,I14>I12),1,IF(AND(J15=J12,I15>I12),1,IF(AND(J14=J13,I14>I13),1,IF(AND(J15=J13,I15>I13),1,IF(AND(J15=J14,I15>I14),1,0))))))","v":0},{"$f":"IF(AND(J13=J14,I13=I14),1,0)","v":1},{"$f":"IF(AND(N13=1,G13=G14),1,0)","v":1},{"$f":"IF(SUM(N13+O13)=2,1,0)","v":1},{"$f":"IF(P13=2,\"2>3 ?\",\"\")","v":""}]
[null,{"$f":"Grid!$B$11","v":"Canada"},{"$f":"Grid!$P$11","v":0},{"$f":"Grid!$Q$11","v":0},{"$f":"Grid!$R$11","v":0},{"$f":"Grid!$S$11","v":0},{"$f":"Grid!$T$11","v":0},{"$f":"Grid!$U$11","v":0},{"$f":"Grid!$V$11","v":0},{"$f":"Grid!$W$11","v":0},3,3,null,{"$f":"IF(AND(J14=J15,I14=I15),1,0)","v":1},{"$f":"IF(AND(N14=1,G14=G15),1,0)","v":1},{"$f":"IF(SUM(N14+O14)=2,1,0)","v":1},{"$f":"IF(P14=2,\"3>4 ?\",\"\")","v":""}]
[null,{"$f":"Grid!$B$10","v":"Qatar"},{"$f":"Grid!$P$10","v":0},{"$f":"Grid!$Q$10","v":0},{"$f":"Grid!$R$10","v":0},{"$f":"Grid!$S$10","v":0},{"$f":"Grid!$T$10","v":0},{"$f":"Grid!$U$10","v":0},{"$f":"Grid!$V$10","v":0},{"$f":"Grid!$W$10","v":0},4,4,null,null,null,null,{"$f":"IF(SUM(C12:C15)=0,\"Table OK\",IF(M16=\"Sort Table\",\"Sort Table\",IF(SUM(P12:P14)=0,\"Table OK\",\"Swap?\")))","v":"Table OK"}]
[null,null,null,null,null,null,null,null,null,null,null,null,{"$f":"IF(SUM(M12:M15)=0,\"\",\"Sort Table\")","v":""}]
[]
[null,{"$f":"Grid!$B$16","v":"Incomplete"},{"$f":"Grid!$P$16","v":"P"},{"$f":"Grid!$Q$16","v":"W"},{"$f":"Grid!$R$16","v":"D"},{"$f":"Grid!$S$16","v":"L"},{"$f":"Grid!$T$16","v":"F"},{"$f":"Grid!$U$16","v":"A"},{"$f":"Grid!$V$16","v":"GD"},{"$f":"Grid!$W$16","v":"Pts"},"Pre","Post"]
[null,{"$f":"Grid!$B$19","v":"Brazil"},{"$f":"Grid!$P$19","v":0},{"$f":"Grid!$Q$19","v":0},{"$f":"Grid!$R$19","v":0},{"$f":"Grid!$S$19","v":0},{"$f":"Grid!$T$19","v":0},{"$f":"Grid!$U$19","v":0},{"$f":"Grid!$V$19","v":0},{"$f":"Grid!$W$19","v":0},1,1,{"$f":"IF(J20>J19,1,IF(J21>J19,1,IF(J22>J19,1,IF(J21>J20,1,IF(J22>J20,1,IF(J22>J21,1,0))))))","v":0},{"$f":"IF(AND(J19=J20,I19=I20),1,0)","v":1},{"$f":"IF(AND(N19=1,G19=G20),1,0)","v":1},{"$f":"IF(SUM(N19+O19)=2,1,0)","v":1},{"$f":"IF(P19=2,\"1>2 ?\",\"\")","v":""}]
[null,{"$f":"Grid!$B$18","v":"Scotland"},{"$f":"Grid!$P$18","v":0},{"$f":"Grid!$Q$18","v":0},{"$f":"Grid!$R$18","v":0},{"$f":"Grid!$S$18","v":0},{"$f":"Grid!$T$18","v":0},{"$f":"Grid!$U$18","v":0},{"$f":"Grid!$V$18","v":0},{"$f":"Grid!$W$18","v":0},2,2,{"$f":"IF(AND(J20=J19,I20>I19),1,IF(AND(J21=J19,I21>I19),1,IF(AND(J22=J19,I22>I19),1,IF(AND(J21=J20,I21>I20),1,IF(AND(J22=J20,I22>I20),1,IF(AND(J22=J21,I22>I21),1,0))))))","v":0},{"$f":"IF(AND(J20=J21,I20=I21),1,0)","v":1},{"$f":"IF(AND(N20=1,G20=G21),1,0)","v":1},{"$f":"IF(SUM(N20+O20)=2,1,0)","v":1},{"$f":"IF(P20=2,\"2>3 ?\",\"\")","v":""}]
[null,{"$f":"Grid!$B$20","v":"Morocco"},{"$f":"Grid!$P$20","v":0},{"$f":"Grid!$Q$20","v":0},{"$f":"Grid!$R$20","v":0},{"$f":"Grid!$S$20","v":0},{"$f":"Grid!$T$20","v":0},{"$f":"Grid!$U$20","v":0},{"$f":"Grid!$V$20","v":0},{"$f":"Grid!$W$20","v":0},3,3,null,{"$f":"IF(AND(J21=J22,I21=I22),1,0)","v":1},{"$f":"IF(AND(N21=1,G21=G22),1,0)","v":1},{"$f":"IF(SUM(N21+O21)=2,1,0)","v":1},{"$f":"IF(P21=2,\"3>4 ?\",\"\")","v":""}]
[null,{"$f":"Grid!$B$17","v":"Haiti"},{"$f":"Grid!$P$17","v":0},{"$f":"Grid!$Q$17","v":0},{"$f":"Grid!$R$17","v":0},{"$f":"Grid!$S$17","v":0},{"$f":"Grid!$T$17","v":0},{"$f":"Grid!$U$17","v":0},{"$f":"Grid!$V$17","v":0},{"$f":"Grid!$W$17","v":0},4,4,null,null,null,null,{"$f":"IF(SUM(C19:C22)=0,\"Table OK\",IF(M23=\"Sort Table\",\"Sort Table\",IF(SUM(P19:P21)=0,\"Table OK\",\"Swap?\")))","v":"Table OK"}]
[null,null,null,null,null,null,null,null,null,null,null,null,{"$f":"IF(SUM(M19:M22)=0,\"\",\"Sort Table\")","v":""}]
[]
[null,{"$f":"Grid!$B$23","v":"Incomplete"},{"$f":"Grid!$P$23","v":"P"},{"$f":"Grid!$Q$23","v":"W"},{"$f":"Grid!$R$23","v":"D"},{"$f":"Grid!$S$23","v":"L"},{"$f":"Grid!$T$23","v":"F"},{"$f":"Grid!$U$23","v":"A"},{"$f":"Grid!$V$23","v":"GD"},{"$f":"Grid!$W$23","v":"Pts"},"Pre","Post"]
[null,{"$f":"Grid!$B$25","v":"Australia"},{"$f":"Grid!$P$25","v":0},{"$f":"Grid!$Q$25","v":0},{"$f":"Grid!$R$25","v":0},{"$f":"Grid!$S$25","v":0},{"$f":"Grid!$T$25","v":0},{"$f":"Grid!$U$25","v":0},{"$f":"Grid!$V$25","v":0},{"$f":"Grid!$W$25","v":0},1,1,{"$f":"IF(J27>J26,1,IF(J28>J26,1,IF(J29>J26,1,IF(J28>J27,1,IF(J29>J27,1,IF(J29>J28,1,0))))))","v":0},{"$f":"IF(AND(J26=J27,I26=I27),1,0)","v":1},{"$f":"IF(AND(N26=1,G26=G27),1,0)","v":1},{"$f":"IF(SUM(N26+O26)=2,1,0)","v":1},{"$f":"IF(P26=2,\"1>2 ?\",\"\")","v":""}]
[null,{"$f":"Grid!$B$27","v":"Paraguay"},{"$f":"Grid!$P$27","v":0},{"$f":"Grid!$Q$27","v":0},{"$f":"Grid!$R$27","v":0},{"$f":"Grid!$S$27","v":0},{"$f":"Grid!$T$27","v":0},{"$f":"Grid!$U$27","v":0},{"$f":"Grid!$V$27","v":0},{"$f":"Grid!$W$27","v":0},2,2,{"$f":"IF(AND(J27=J26,I27>I26),1,IF(AND(J28=J26,I28>I26),1,IF(AND(J29=J26,I29>I26),1,IF(AND(J28=J27,I28>I27),1,IF(AND(J29=J27,I29>I27),1,IF(AND(J29=J28,I29>I28),1,0))))))","v":0},{"$f":"IF(AND(J27=J28,I27=I28),1,0)","v":1},{"$f":"IF(AND(N27=1,G27=G28),1,0)","v":1},{"$f":"IF(SUM(N27+O27)=2,1,0)","v":1},{"$f":"IF(P27=2,\"2>3 ?\",\"\")","v":""}]
[null,{"$f":"Grid!$B$24","v":"(TUR,ROM,SVK,KOS)"},{"$f":"Grid!$P$24","v":0},{"$f":"Grid!$Q$24","v":0},{"$f":"Grid!$R$24","v":0},{"$f":"Grid!$S$24","v":0},{"$f":"Grid!$T$24","v":0},{"$f":"Grid!$U$24","v":0},{"$f":"Grid!$V$24","v":0},{"$f":"Grid!$W$24","v":0},3,3,null,{"$f":"IF(AND(J28=J29,I28=I29),1,0)","v":1},{"$f":"IF(AND(N28=1,G28=G29),1,0)","v":1},{"$f":"IF(SUM(N28+O28)=2,1,0)","v":1},{"$f":"IF(P28=2,\"3>4 ?\",\"\")","v":""}]
[null,{"$f":"Grid!$B$26","v":"USA"},{"$f":"Grid!$P$26","v":0},{"$f":"Grid!$Q$26","v":0},{"$f":"Grid!$R$26","v":0},{"$f":"Grid!$S$26","v":0},{"$f":"Grid!$T$26","v":0},{"$f":"Grid!$U$26","v":0},{"$f":"Grid!$V$26","v":0},{"$f":"Grid!$W$26","v":0},4,4,null,null,null,null,{"$f":"IF(SUM(C26:C29)=0,\"Table OK\",IF(M30=\"Sort Table\",\"Sort Table\",IF(SUM(P26:P28)=0,\"Table OK\",\"Swap?\")))","v":"Table OK"}]
[null,null,null,null,null,null,null,null,null,null,null,null,{"$f":"IF(SUM(M26:M29)=0,\"\",\"Sort Table\")","v":""}]
[]
[null,{"$f":"Grid!$B$30","v":"Incomplete"},{"$f":"Grid!$P$30","v":"P"},{"$f":"Grid!$Q$30","v":"W"},{"$f":"Grid!$R$30","v":"D"},{"$f":"Grid!$S$30","v":"L"},{"$f":"Grid!$T$30","v":"F"},{"$f":"Grid!$U$30","v":"A"},{"$f":"Grid!$V$30","v":"GD"},{"$f":"Grid!$W$30","v":"Pts"},"Pre","Post"]
[null,{"$f":"Grid!$B$32","v":"Germany"},{"$f":"Grid!$P$32","v":0},{"$f":"Grid!$Q$32","v":0},{"$f":"Grid!$R$32","v":0},{"$f":"Grid!$S$32","v":0},{"$f":"Grid!$T$32","v":0},{"$f":"Grid!$U$32","v":0},{"$f":"Grid!$V$32","v":0},{"$f":"Grid!$W$32","v":0},1,1,{"$f":"IF(J34>J33,1,IF(J35>J33,1,IF(J36>J33,1,IF(J35>J34,1,IF(J36>J34,1,IF(J36>J35,1,0))))))","v":0},{"$f":"IF(AND(J33=J34,I33=I34),1,0)","v":1},{"$f":"IF(AND(N33=1,G33=G34),1,0)","v":1},{"$f":"IF(SUM(N33+O33)=2,1,0)","v":1},{"$f":"IF(P33=2,\"1>2 ?\",\"\")","v":""}]
[null,{"$f":"Grid!$B$31","v":"Côte d'Ivoire"},{"$f":"Grid!$P$31","v":0},{"$f":"Grid!$Q$31","v":0},{"$f":"Grid!$R$31","v":0},{"$f":"Grid!$S$31","v":0},{"$f":"Grid!$T$31","v":0},{"$f":"Grid!$U$31","v":0},{"$f":"Grid!$V$31","v":0},{"$f":"Grid!$W$31","v":0},2,2,{"$f":"IF(AND(J34=J33,I34>I33),1,IF(AND(J35=J33,I35>I33),1,IF(AND(J36=J33,I36>I33),1,IF(AND(J35=J34,I35>I34),1,IF(AND(J36=J34,I36>I34),1,IF(AND(J36=J35,I36>I35),1,0))))))","v":0},{"$f":"IF(AND(J34=J35,I34=I35),1,0)","v":1},{"$f":"IF(AND(N34=1,G34=G35),1,0)","v":1},{"$f":"IF(SUM(N34+O34)=2,1,0)","v":1},{"$f":"IF(P34=2,\"2>3 ?\",\"\")","v":""}]
[null,{"$f":"Grid!$B$33","v":"Ecuador"},{"$f":"Grid!$P$33","v":0},{"$f":"Grid!$Q$33","v":0},{"$f":"Grid!$R$33","v":0},{"$f":"Grid!$S$33","v":0},{"$f":"Grid!$T$33","v":0},{"$f":"Grid!$U$33","v":0},{"$f":"Grid!$V$33","v":0},{"$f":"Grid!$W$33","v":0},3,3,null,{"$f":"IF(AND(J35=J36,I35=I36),1,0)","v":1},{"$f":"IF(AND(N35=1,G35=G36),1,0)","v":1},{"$f":"IF(SUM(N35+O35)=2,1,0)","v":1},{"$f":"IF(P35=2,\"3>4 ?\",\"\")","v":""}]
[null,{"$f":"Grid!$B$34","v":"Curaçao"},{"$f":"Grid!$P$34","v":0},{"$f":"Grid!$Q$34","v":0},{"$f":"Grid!$R$34","v":0},{"$f":"Grid!$S$34","v":0},{"$f":"Grid!$T$34","v":0},{"$f":"Grid!$U$34","v":0},{"$f":"Grid!$V$34","v":0},{"$f":"Grid!$W$34","v":0},4,4,null,null,null,null,{"$f":"IF(SUM(C33:C36)=0,\"Table OK\",IF(M37=\"Sort Table\",\"Sort Table\",IF(SUM(P33:P35)=0,\"Table OK\",\"Swap?\")))","v":"Table OK"}]
[null,null,null,null,null,null,null,null,null,null,null,null,{"$f":"IF(SUM(M33:M36)=0,\"\",\"Sort Table\")","v":""}]
[]
[null,{"$f":"Grid!$B$37","v":"Incomplete"},{"$f":"Grid!$P$37","v":"P"},{"$f":"Grid!$Q$37","v":"W"},{"$f":"Grid!$R$37","v":"D"},{"$f":"Grid!$S$37","v":"L"},{"$f":"Grid!$T$37","v":"F"},{"$f":"Grid!$U$37","v":"A"},{"$f":"Grid!$V$37","v":"GD"},{"$f":"Grid!$W$37","v":"Pts"},"Pre","Post"]
[null,{"$f":"Grid!$B$39","v":"Netherlands"},{"$f":"Grid!$P$39","v":0},{"$f":"Grid!$Q$39","v":0},{"$f":"Grid!$R$39","v":0},{"$f":"Grid!$S$39","v":0},{"$f":"Grid!$T$39","v":0},{"$f":"Grid!$U$39","v":0},{"$f":"Grid!$V$39","v":0},{"$f":"Grid!$W$39","v":0},1,1,{"$f":"IF(J41>J40,1,IF(J42>J40,1,IF(J43>J40,1,IF(J42>J41,1,IF(J43>J41,1,IF(J43>J42,1,0))))))","v":0},{"$f":"IF(AND(J40=J41,I40=I41),1,0)","v":1},{"$f":"IF(AND(N40=1,G40=G41),1,0)","v":1},{"$f":"IF(SUM(N40+O40)=2,1,0)","v":1},{"$f":"IF(P40=2,\"1>2 ?\",\"\")","v":""}]
[null,{"$f":"Grid!$B$41","v":"Japan"},{"$f":"Grid!$P$41","v":0},{"$f":"Grid!$Q$41","v":0},{"$f":"Grid!$R$41","v":0},{"$f":"Grid!$S$41","v":0},{"$f":"Grid!$T$41","v":0},{"$f":"Grid!$U$41","v":0},{"$f":"Grid!$V$41","v":0},{"$f":"Grid!$W$41","v":0},2,2,{"$f":"IF(AND(J41=J40,I41>I40),1,IF(AND(J42=J40,I42>I40),1,IF(AND(J43=J40,I43>I40),1,IF(AND(J42=J41,I42>I41),1,IF(AND(J43=J41,I43>I41),1,IF(AND(J43=J42,I43>I42),1,0))))))","v":0},{"$f":"IF(AND(J41=J42,I41=I42),1,0)","v":1},{"$f":"IF(AND(N41=1,G41=G42),1,0)","v":1},{"$f":"IF(SUM(N41+O41)=2,1,0)","v":1},{"$f":"IF(P41=2,\"2>3 ?\",\"\")","v":""}]
[null,{"$f":"Grid!$B$38","v":"(UKR,SWE,POL,ALB)"},{"$f":"Grid!$P$38","v":0},{"$f":"Grid!$Q$38","v":0},{"$f":"Grid!$R$38","v":0},{"$f":"Grid!$S$38","v":0},{"$f":"Grid!$T$38","v":0},{"$f":"Grid!$U$38","v":0},{"$f":"Grid!$V$38","v":0},{"$f":"Grid!$W$38","v":0},3,3,null,{"$f":"IF(AND(J42=J43,I42=I43),1,0)","v":1},{"$f":"IF(AND(N42=1,G42=G43),1,0)","v":1},{"$f":"IF(SUM(N42+O42)=2,1,0)","v":1},{"$f":"IF(P42=2,\"3>4 ?\",\"\")","v":""}]
[null,{"$f":"Grid!$B$40","v":"Tunisia"},{"$f":"Grid!$P$40","v":0},{"$f":"Grid!$Q$40","v":0},{"$f":"Grid!$R$40","v":0},{"$f":"Grid!$S$40","v":0},{"$f":"Grid!$T$40","v":0},{"$f":"Grid!$U$40","v":0},{"$f":"Grid!$V$40","v":0},{"$f":"Grid!$W$40","v":0},4,4,null,null,null,null,{"$f":"IF(SUM(C40:C43)=0,\"Table OK\",IF(M44=\"Sort Table\",\"Sort Table\",IF(SUM(P40:P42)=0,\"Table OK\",\"Swap?\")))","v":"Table OK"}]
[null,null,null,null,null,null,null,null,null,null,null,null,{"$f":"IF(SUM(M40:M43)=0,\"\",\"Sort Table\")","v":""}]
[]
[null,{"$f":"Grid!$B$44","v":"Incomplete"},{"$f":"Grid!$P$44","v":"P"},{"$f":"Grid!$Q$44","v":"W"},{"$f":"Grid!$R$44","v":"D"},{"$f":"Grid!$S$44","v":"L"},{"$f":"Grid!$T$44","v":"F"},{"$f":"Grid!$U$44","v":"A"},{"$f":"Grid!$V$44","v":"GD"},{"$f":"Grid!$W$44","v":"Pts"},"Pre","Post"]
[null,{"$f":"Grid!$B$46","v":"Belgium"},{"$f":"Grid!$P$46","v":0},{"$f":"Grid!$Q$46","v":0},{"$f":"Grid!$R$46","v":0},{"$f":"Grid!$S$46","v":0},{"$f":"Grid!$T$46","v":0},{"$f":"Grid!$U$46","v":0},{"$f":"Grid!$V$46","v":0},{"$f":"Grid!$W$46","v":0},1,1,{"$f":"IF(J48>J47,1,IF(J49>J47,1,IF(J50>J47,1,IF(J49>J48,1,IF(J50>J48,1,IF(J50>J49,1,0))))))","v":0},{"$f":"IF(AND(J47=J48,I47=I48),1,0)","v":1},{"$f":"IF(AND(N47=1,G47=G48),1,0)","v":1},{"$f":"IF(SUM(N47+O47)=2,1,0)","v":1},{"$f":"IF(P47=2,\"1>2 ?\",\"\")","v":""}]
[null,{"$f":"Grid!$B$48","v":"Egypt"},{"$f":"Grid!$P$48","v":0},{"$f":"Grid!$Q$48","v":0},{"$f":"Grid!$R$48","v":0},{"$f":"Grid!$S$48","v":0},{"$f":"Grid!$T$48","v":0},{"$f":"Grid!$U$48","v":0},{"$f":"Grid!$V$48","v":0},{"$f":"Grid!$W$48","v":0},2,2,{"$f":"IF(AND(J48=J47,I48>I47),1,IF(AND(J49=J47,I49>I47),1,IF(AND(J50=J47,I50>I47),1,IF(AND(J49=J48,I49>I48),1,IF(AND(J50=J48,I50>I48),1,IF(AND(J50=J49,I50>I49),1,0))))))","v":0},{"$f":"IF(AND(J48=J49,I48=I49),1,0)","v":1},{"$f":"IF(AND(N48=1,G48=G49),1,0)","v":1},{"$f":"IF(SUM(N48+O48)=2,1,0)","v":1},{"$f":"IF(P48=2,\"2>3 ?\",\"\")","v":""}]
[null,{"$f":"Grid!$B$45","v":"Iran"},{"$f":"Grid!$P$45","v":0},{"$f":"Grid!$Q$45","v":0},{"$f":"Grid!$R$45","v":0},{"$f":"Grid!$S$45","v":0},{"$f":"Grid!$T$45","v":0},{"$f":"Grid!$U$45","v":0},{"$f":"Grid!$V$45","v":0},{"$f":"Grid!$W$45","v":0},3,3,null,{"$f":"IF(AND(J49=J50,I49=I50),1,0)","v":1},{"$f":"IF(AND(N49=1,G49=G50),1,0)","v":1},{"$f":"IF(SUM(N49+O49)=2,1,0)","v":1},{"$f":"IF(P49=2,\"3>4 ?\",\"\")","v":""}]
[null,{"$f":"Grid!$B$47","v":"NewZealand"},{"$f":"Grid!$P$47","v":0},{"$f":"Grid!$Q$47","v":0},{"$f":"Grid!$R$47","v":0},{"$f":"Grid!$S$47","v":0},{"$f":"Grid!$T$47","v":0},{"$f":"Grid!$U$47","v":0},{"$f":"Grid!$V$47","v":0},{"$f":"Grid!$W$47","v":0},4,4,null,null,null,null,{"$f":"IF(SUM(C47:C49)=0,\"Table OK\",IF(M51=\"Sort Table\",\"Sort Table\",IF(SUM(P47:P49)=0,\"Table OK\",\"Swap?\")))","v":"Table OK"}]
[null,null,null,null,null,null,null,null,null,null,null,null,{"$f":"IF(SUM(M47:M50)=0,\"\",\"Sort Table\")","v":""}]
[]
[null,{"$f":"Grid!$B$51","v":"Incomplete"},{"$f":"Grid!$P$51","v":"P"},{"$f":"Grid!$Q$51","v":"W"},{"$f":"Grid!$R$51","v":"D"},{"$f":"Grid!$S$51","v":"L"},{"$f":"Grid!$T$51","v":"F"},{"$f":"Grid!$U$51","v":"A"},{"$f":"Grid!$V$51","v":"GD"},{"$f":"Grid!W51","v":"Pts"},"Pre","Post"]
[null,{"$f":"Grid!B54","v":"Spain"},{"$f":"Grid!P54","v":0},{"$f":"Grid!Q54","v":0},{"$f":"Grid!R54","v":0},{"$f":"Grid!S54","v":0},{"$f":"Grid!T54","v":0},{"$f":"Grid!U54","v":0},{"$f":"Grid!V54","v":0},{"$f":"Grid!W54","v":0},1,1,{"$f":"IF(J55>J54,1,IF(J56>J54,1,IF(J57>J54,1,IF(J56>J55,1,IF(J57>J55,1,IF(J57>J56,1,0))))))","v":0},{"$f":"IF(AND(J54=J55,I54=I55),1,0)","v":1},{"$f":"IF(AND(N54=1,G54=G55),1,0)","v":1},{"$f":"IF(SUM(N54+O54)=2,1,0)","v":1},{"$f":"IF(P54=2,\"1>2 ?\",\"\")","v":""}]
[null,{"$f":"Grid!B53","v":"Uruguay"},{"$f":"Grid!P53","v":0},{"$f":"Grid!Q53","v":0},{"$f":"Grid!R53","v":0},{"$f":"Grid!S53","v":0},{"$f":"Grid!T53","v":0},{"$f":"Grid!U53","v":0},{"$f":"Grid!V53","v":0},{"$f":"Grid!W53","v":0},2,2,{"$f":"IF(AND(J55=J54,I55>I54),1,IF(AND(J56=J54,I56>I54),1,IF(AND(J57=J54,I57>I54),1,IF(AND(J56=J55,I56>I55),1,IF(AND(J57=J55,I57>I55),1,IF(AND(J57=J56,I57>I56),1,0))))))","v":0},{"$f":"IF(AND(J55=J56,I55=I56),1,0)","v":1},{"$f":"IF(AND(N55=1,G55=G56),1,0)","v":1},{"$f":"IF(SUM(N55+O55)=2,1,0)","v":1},{"$f":"IF(P55=2,\"2>3 ?\",\"\")","v":""}]
[null,{"$f":"Grid!B52","v":"Saudi Arabia"},{"$f":"Grid!P52","v":0},{"$f":"Grid!Q52","v":0},{"$f":"Grid!R52","v":0},{"$f":"Grid!S52","v":0},{"$f":"Grid!T52","v":0},{"$f":"Grid!U52","v":0},{"$f":"Grid!V52","v":0},{"$f":"Grid!W52","v":0},3,3,null,{"$f":"IF(AND(J56=J57,I56=I57),1,0)","v":1},{"$f":"IF(AND(N56=1,G56=G57),1,0)","v":1},{"$f":"IF(SUM(N56+O56)=2,1,0)","v":1},{"$f":"IF(P56=2,\"3>4 ?\",\"\")","v":""}]
[null,{"$f":"Grid!B55","v":"Cape Verde"},{"$f":"Grid!P55","v":0},{"$f":"Grid!Q55","v":0},{"$f":"Grid!R55","v":0},{"$f":"Grid!S55","v":0},{"$f":"Grid!T55","v":0},{"$f":"Grid!U55","v":0},{"$f":"Grid!V55","v":0},{"$f":"Grid!W55","v":0},4,4,null,null,null,null,{"$f":"IF(SUM(C54:C57)=0,\"Table OK\",IF(M58=\"Sort Table\",\"Sort Table\",IF(SUM(P54:P56)=0,\"Table OK\",\"Swap?\")))","v":"Table OK"}]
[null,null,null,null,null,null,null,null,null,null,null,null,{"$f":"IF(SUM(M54:M57)=0,\"\",\"Sort Table\")","v":""}]
[]
[null,{"$f":"Grid!$B$58","v":"Incomplete"},{"$f":"Grid!$P$58","v":"P"},{"$f":"Grid!$Q$58","v":"W"},{"$f":"Grid!$R$58","v":"D"},{"$f":"Grid!$S$58","v":"L"},{"$f":"Grid!$T$58","v":"F"},{"$f":"Grid!$U$58","v":"A"},{"$f":"Grid!$V$58","v":"GD"},{"$f":"Grid!$W$58","v":"Pts"},"Pre","Post"]
[null,{"$f":"Grid!$B$61","v":"Norway"},{"$f":"Grid!$P$61","v":0},{"$f":"Grid!$Q$61","v":0},{"$f":"Grid!$R$61","v":0},{"$f":"Grid!$S$61","v":0},{"$f":"Grid!$T$61","v":0},{"$f":"Grid!$U$61","v":0},{"$f":"Grid!$V$61","v":0},{"$f":"Grid!$W$61","v":0},1,1,{"$f":"IF(J62>J61,1,IF(J63>J61,1,IF(J64>J61,1,IF(J63>J62,1,IF(J64>J62,1,IF(J64>J63,1,0))))))","v":0},{"$f":"IF(AND(J61=J62,I61=I62),1,0)","v":1},{"$f":"IF(AND(N61=1,G61=G62),1,0)","v":1},{"$f":"IF(SUM(N61+O61)=2,1,0)","v":1},{"$f":"IF(P61=2,\"1>2 ?\",\"\")","v":""}]
[null,{"$f":"Grid!$B$60","v":"France"},{"$f":"Grid!$P$60","v":0},{"$f":"Grid!$Q$60","v":0},{"$f":"Grid!$R$60","v":0},{"$f":"Grid!$S$60","v":0},{"$f":"Grid!$T$60","v":0},{"$f":"Grid!$U$60","v":0},{"$f":"Grid!$V$60","v":0},{"$f":"Grid!$W$60","v":0},2,2,{"$f":"IF(AND(J62=J61,I62>I61),1,IF(AND(J63=J61,I63>I61),1,IF(AND(J64=J61,I64>I61),1,IF(AND(J63=J62,I63>I62),1,IF(AND(J64=J62,I64>I62),1,IF(AND(J64=J63,I64>I63),1,0))))))","v":0},{"$f":"IF(AND(J62=J63,I62=I63),1,0)","v":1},{"$f":"IF(AND(N62=1,G62=G63),1,0)","v":1},{"$f":"IF(SUM(N62+O62)=2,1,0)","v":1},{"$f":"IF(P62=2,\"2>3 ?\",\"\")","v":""}]
[null,{"$f":"Grid!$B$62","v":"Senegal"},{"$f":"Grid!$P$62","v":0},{"$f":"Grid!$Q$62","v":0},{"$f":"Grid!$R$62","v":0},{"$f":"Grid!$S$62","v":0},{"$f":"Grid!$T$62","v":0},{"$f":"Grid!$U$62","v":0},{"$f":"Grid!$V$62","v":0},{"$f":"Grid!$W$62","v":0},3,3,null,{"$f":"IF(AND(J63=J64,I63=I64),1,0)","v":1},{"$f":"IF(AND(N63=1,G63=G64),1,0)","v":1},{"$f":"IF(SUM(N63+O63)=2,1,0)","v":1},{"$f":"IF(P63=2,\"3>4 ?\",\"\")","v":""}]
[null,{"$f":"Grid!$B$59","v":"(BOL,SUR,IRQ)"},{"$f":"Grid!$P$59","v":0},{"$f":"Grid!$Q$59","v":0},{"$f":"Grid!$R$59","v":0},{"$f":"Grid!$S$59","v":0},{"$f":"Grid!$T$59","v":0},{"$f":"Grid!$U$59","v":0},{"$f":"Grid!$V$59","v":0},{"$f":"Grid!$W$59","v":0},4,4,null,null,null,null,{"$f":"IF(SUM(C61:C64)=0,\"Table OK\",IF(M65=\"Sort Table\",\"Sort Table\",IF(SUM(P61:P63)=0,\"Table OK\",\"Swap?\")))","v":"Table OK"}]
[null,null,null,null,null,null,null,null,null,null,null,null,{"$f":"IF(SUM(M61:M64)=0,\"\",\"Sort Table\")","v":""}]
[]
[null,{"$f":"Grid!$B$65","v":"Incomplete"},{"$f":"Grid!$P$65","v":"P"},{"$f":"Grid!$Q$65","v":"W"},{"$f":"Grid!$R$65","v":"D"},{"$f":"Grid!$S$65","v":"L"},{"$f":"Grid!$T$65","v":"F"},{"$f":"Grid!$U$65","v":"A"},{"$f":"Grid!$V$65","v":"GD"},{"$f":"Grid!$W$65","v":"Pts"},"Pre","Post"]
[null,{"$f":"Grid!$B$68","v":"Argentina"},{"$f":"Grid!$P$68","v":0},{"$f":"Grid!$Q$68","v":0},{"$f":"Grid!$R$68","v":0},{"$f":"Grid!$S$68","v":0},{"$f":"Grid!$T$68","v":0},{"$f":"Grid!$U$68","v":0},{"$f":"Grid!$V$68","v":0},{"$f":"Grid!$W$68","v":0},1,1,{"$f":"IF(J69>J68,1,IF(J70>J68,1,IF(J71>J68,1,IF(J70>J69,1,IF(J71>J69,1,IF(J71>J70,1,0))))))","v":0},{"$f":"IF(AND(J68=J69,I68=I69),1,0)","v":1},{"$f":"IF(AND(N68=1,G68=G69),1,0)","v":1},{"$f":"IF(SUM(N68+O68)=2,1,0)","v":1},{"$f":"IF(P68=2,\"1>2 ?\",\"\")","v":""}]
[null,{"$f":"Grid!$B$66","v":"Austria"},{"$f":"Grid!$P$66","v":0},{"$f":"Grid!$Q$66","v":0},{"$f":"Grid!$R$66","v":0},{"$f":"Grid!$S$66","v":0},{"$f":"Grid!$T$66","v":0},{"$f":"Grid!$U$66","v":0},{"$f":"Grid!$V$66","v":0},{"$f":"Grid!$W$66","v":0},2,2,{"$f":"IF(AND(J69=J68,I69>I68),1,IF(AND(J70=J68,I70>I68),1,IF(AND(J71=J68,I71>I68),1,IF(AND(J70=J69,I70>I69),1,IF(AND(J71=J69,I71>I69),1,IF(AND(J71=J70,I71>I70),1,0))))))","v":0},{"$f":"IF(AND(J69=J70,I69=I70),1,0)","v":1},{"$f":"IF(AND(N69=1,G69=G70),1,0)","v":1},{"$f":"IF(SUM(N69+O69)=2,1,0)","v":1},{"$f":"IF(P69=2,\"2>3 ?\",\"\")","v":""}]
[null,{"$f":"Grid!$B$69","v":"Algeria"},{"$f":"Grid!$P$69","v":0},{"$f":"Grid!$Q$69","v":0},{"$f":"Grid!$R$69","v":0},{"$f":"Grid!$S$69","v":0},{"$f":"Grid!$T$69","v":0},{"$f":"Grid!$U$69","v":0},{"$f":"Grid!$V$69","v":0},{"$f":"Grid!$W$69","v":0},3,3,null,{"$f":"IF(AND(J70=J71,I70=I71),1,0)","v":1},{"$f":"IF(AND(N70=1,G70=G71),1,0)","v":1},{"$f":"IF(SUM(N70+O70)=2,1,0)","v":1},{"$f":"IF(P70=2,\"3>4 ?\",\"\")","v":""}]
[null,{"$f":"Grid!$B$67","v":"Jordan"},{"$f":"Grid!$P$67","v":0},{"$f":"Grid!$Q$67","v":0},{"$f":"Grid!$R$67","v":0},{"$f":"Grid!$S$67","v":0},{"$f":"Grid!$T$67","v":0},{"$f":"Grid!$U$67","v":0},{"$f":"Grid!$V$67","v":0},{"$f":"Grid!$W$67","v":0},4,4,null,null,null,null,{"$f":"IF(SUM(C68:C71)=0,\"Table OK\",IF(M72=\"Sort Table\",\"Sort Table\",IF(SUM(P68:P70)=0,\"Table OK\",\"Swap?\")))","v":"Table OK"}]
[null,null,null,null,null,null,null,null,null,null,null,null,{"$f":"IF(SUM(M68:M71)=0,\"\",\"Sort Table\")","v":""}]
[]
[null,{"$f":"Grid!$B$72","v":"Incomplete"},{"$f":"Grid!$P$72","v":"P"},{"$f":"Grid!$Q$72","v":"W"},{"$f":"Grid!$R$72","v":"D"},{"$f":"Grid!$S$72","v":"L"},{"$f":"Grid!$T$72","v":"F"},{"$f":"Grid!$U$72","v":"A"},{"$f":"Grid!$V$72","v":"GD"},{"$f":"Grid!$W$72","v":"Pts"},"Pre","Post"]
[null,{"$f":"Grid!$B$74","v":"Portugal"},{"$f":"Grid!$P$74","v":0},{"$f":"Grid!$Q$74","v":0},{"$f":"Grid!$R$74","v":0},{"$f":"Grid!$S$74","v":0},{"$f":"Grid!$T$74","v":0},{"$f":"Grid!$U$74","v":0},{"$f":"Grid!$V$74","v":0},{"$f":"Grid!$W$74","v":0},1,1,{"$f":"IF(J76>J75,1,IF(J77>J75,1,IF(J78>J75,1,IF(J77>J76,1,IF(J78>J76,1,IF(J78>J77,1,0))))))","v":0},{"$f":"IF(AND(J75=J76,I75=I76),1,0)","v":1},{"$f":"IF(AND(N75=1,G75=G76),1,0)","v":1},{"$f":"IF(SUM(N75+O75)=2,1,0)","v":1},{"$f":"IF(P75=2,\"1>2 ?\",\"\")","v":""}]
[null,{"$f":"Grid!$B$75","v":"Colombia"},{"$f":"Grid!$P$75","v":0},{"$f":"Grid!$Q$75","v":0},{"$f":"Grid!$R$75","v":0},{"$f":"Grid!$S$75","v":0},{"$f":"Grid!$T$75","v":0},{"$f":"Grid!$U$75","v":0},{"$f":"Grid!$V$75","v":0},{"$f":"Grid!$W$75","v":0},2,2,{"$f":"IF(AND(J76=J75,I76>I75),1,IF(AND(J77=J75,I77>I75),1,IF(AND(J78=J75,I78>I75),1,IF(AND(J77=J76,I77>I76),1,IF(AND(J78=J76,I78>I76),1,IF(AND(J78=J77,I78>I77),1,0))))))","v":0},{"$f":"IF(AND(J76=J77,I76=I77),1,0)","v":1},{"$f":"IF(AND(N76=1,G76=G77),1,0)","v":1},{"$f":"IF(SUM(N76+O76)=2,1,0)","v":1},{"$f":"IF(P76=2,\"2>3 ?\",\"\")","v":""}]
[null,{"$f":"Grid!$B$73","v":"Uzbekistan"},{"$f":"Grid!$P$73","v":0},{"$f":"Grid!$Q$73","v":0},{"$f":"Grid!$R$73","v":0},{"$f":"Grid!$S$73","v":0},{"$f":"Grid!$T$73","v":0},{"$f":"Grid!$U$73","v":0},{"$f":"Grid!$V$73","v":0},{"$f":"Grid!$W$73","v":0},3,3,null,{"$f":"IF(AND(J77=J78,I77=I78),1,0)","v":1},{"$f":"IF(AND(N77=1,G77=G78),1,0)","v":1},{"$f":"IF(SUM(N77+O77)=2,1,0)","v":1},{"$f":"IF(P77=2,\"3>4 ?\",\"\")","v":""}]
[null,{"$f":"Grid!$B$76","v":"(NCL,JAM,COD)"},{"$f":"Grid!$P$76","v":0},{"$f":"Grid!$Q$76","v":0},{"$f":"Grid!$R$76","v":0},{"$f":"Grid!$S$76","v":0},{"$f":"Grid!$T$76","v":0},{"$f":"Grid!$U$76","v":0},{"$f":"Grid!$V$76","v":0},{"$f":"Grid!$W$76","v":0},4,4,null,null,null,null,{"$f":"IF(SUM(C75:C78)=0,\"Table OK\",IF(M79=\"Sort Table\",\"Sort Table\",IF(SUM(P75:P77)=0,\"Table OK\",\"Swap?\")))","v":"Table OK"}]
[null,null,null,null,null,null,null,null,null,null,null,null,{"$f":"IF(SUM(M75:M78)=0,\"\",\"Sort Table\")","v":""}]
[]
[null,{"$f":"Grid!$B$79","v":"Incomplete"},{"$f":"Grid!$P$79","v":"P"},{"$f":"Grid!$Q$79","v":"W"},{"$f":"Grid!$R$79","v":"D"},{"$f":"Grid!$S$79","v":"L"},{"$f":"Grid!$T$79","v":"F"},{"$f":"Grid!$U$79","v":"A"},{"$f":"Grid!$V$79","v":"GD"},{"$f":"Grid!$W$79","v":"Pts"},"Pre","Post"]
[null,{"$f":"Grid!$B$83","v":"Croatia"},{"$f":"Grid!$P$83","v":0},{"$f":"Grid!$Q$83","v":0},{"$f":"Grid!$R$83","v":0},{"$f":"Grid!$S$83","v":0},{"$f":"Grid!$T$83","v":0},{"$f":"Grid!$U$83","v":0},{"$f":"Grid!$V$83","v":0},{"$f":"Grid!$W$83","v":0},1,1,{"$f":"IF(J83>J82,1,IF(J84>J82,1,IF(J85>J82,1,IF(J84>J83,1,IF(J85>J83,1,IF(J85>J84,1,0))))))","v":0},{"$f":"IF(AND(J82=J83,I82=I83),1,0)","v":1},{"$f":"IF(AND(N82=1,G82=G83),1,0)","v":1},{"$f":"IF(SUM(N82+O82)=2,1,0)","v":1},{"$f":"IF(P82=2,\"1>2 ?\",\"\")","v":""}]
[null,{"$f":"Grid!$B$80","v":"Ghana"},{"$f":"Grid!$P$80","v":0},{"$f":"Grid!$Q$80","v":0},{"$f":"Grid!$R$80","v":0},{"$f":"Grid!$S$80","v":0},{"$f":"Grid!$T$80","v":0},{"$f":"Grid!$U$80","v":0},{"$f":"Grid!$V$80","v":0},{"$f":"Grid!$W$80","v":0},2,2,{"$f":"IF(AND(J83=J82,I83>I82),1,IF(AND(J84=J82,I84>I82),1,IF(AND(J85=J82,I85>I82),1,IF(AND(J84=J83,I84>I83),1,IF(AND(J85=J83,I85>I83),1,IF(AND(J85=J84,I85>I84),1,0))))))","v":0},{"$f":"IF(AND(J83=J84,I83=I84),1,0)","v":1},{"$f":"IF(AND(N83=1,G83=G84),1,0)","v":1},{"$f":"IF(SUM(N83+O83)=2,1,0)","v":1},{"$f":"IF(P83=2,\"2>3 ?\",\"\")","v":""}]
[null,{"$f":"Grid!$B$81","v":"Panama"},{"$f":"Grid!$P$81","v":0},{"$f":"Grid!$Q$81","v":0},{"$f":"Grid!$R$81","v":0},{"$f":"Grid!$S$81","v":0},{"$f":"Grid!$T$81","v":0},{"$f":"Grid!$U$81","v":0},{"$f":"Grid!$V$81","v":0},{"$f":"Grid!$W$81","v":0},3,3,null,{"$f":"IF(AND(J84=J85,I84=I85),1,0)","v":1},{"$f":"IF(AND(N84=1,G84=G85),1,0)","v":1},{"$f":"IF(SUM(N84+O84)=2,1,0)","v":1},{"$f":"IF(P84=2,\"3>4 ?\",\"\")","v":""}]
[null,{"$f":"Grid!$B$82","v":"England"},{"$f":"Grid!$P$82","v":0},{"$f":"Grid!$Q$82","v":0},{"$f":"Grid!$R$82","v":0},{"$f":"Grid!$S$82","v":0},{"$f":"Grid!$T$82","v":0},{"$f":"Grid!$U$82","v":0},{"$f":"Grid!$V$82","v":0},{"$f":"Grid!$W$82","v":0},4,4,null,null,null,null,{"$f":"IF(SUM(C82:C85)=0,\"Table OK\",IF(M86=\"Sort Table\",\"Sort Table\",IF(SUM(P82:P84)=0,\"Table OK\",\"Swap?\")))","v":"Table OK"}]
[null,null,null,null,null,null,null,null,null,null,null,null,{"$f":"IF(SUM(M82:M85)=0,\"\",\"Sort Table\")","v":""}]
[]
[]
[]
[null,"Thirds Sort"]
[null,{"$f":"IF(SUM(C92:C103)=12*3,\"Final Table\",\"Incomplete\")","v":"Incomplete"},{"$f":"Grid!$P$79","v":"P"},{"$f":"Grid!$Q$79","v":"W"},{"$f":"Grid!$R$79","v":"D"},{"$f":"Grid!$S$79","v":"L"},{"$f":"Grid!$T$79","v":"F"},{"$f":"Grid!$U$79","v":"A"},{"$f":"Grid!$V$79","v":"GD"},{"$f":"Grid!$W$79","v":"Pts"},"Pre","Post"]
[null,{"$f":"$B$7","v":"(DEN/MKD/CZE/IRL)"},{"$f":"$C$7","v":0},{"$f":"$D$7","v":0},{"$f":"$E$7","v":0},{"$f":"$F$7","v":0},{"$f":"$G$7","v":0},{"$f":"$H$7","v":0},{"$f":"$I$7","v":0},{"$f":"$J$7","v":0},1,1,{"$f":"IF(J93>J92,1,IF(J94>J92,1,IF(J95>J92,1,IF(J94>J93,1,IF(J95>J93,1,IF(J95>J94,1,0))))))","v":0},{"$f":"IF(AND(J92=J93,I92=I93),1,0)","v":1},{"$f":"IF(AND(N92=1,G92=G93),1,0)","v":1},{"$f":"IF(SUM(N92+O92)=2,1,0)","v":1}]
[null,{"$f":"$B$77","v":"Uzbekistan"},{"$f":"$C$77","v":0},{"$f":"$D$77","v":0},{"$f":"$E$77","v":0},{"$f":"$F$77","v":0},{"$f":"$G$77","v":0},{"$f":"$H$77","v":0},{"$f":"$I$77","v":0},{"$f":"$J$77","v":0},2,2]
[null,{"$f":"$B$70","v":"Algeria"},{"$f":"$C$70","v":0},{"$f":"$D$70","v":0},{"$f":"$E$70","v":0},{"$f":"$F$70","v":0},{"$f":"$G$70","v":0},{"$f":"$H$70","v":0},{"$f":"$I$70","v":0},{"$f":"$J$70","v":0},3,3]
[null,{"$f":"$B$84","v":"Panama"},{"$f":"$C$84","v":0},{"$f":"$D$84","v":0},{"$f":"$E$84","v":0},{"$f":"$F$84","v":0},{"$f":"$G$84","v":0},{"$f":"$H$84","v":0},{"$f":"$I$84","v":0},{"$f":"$J$84","v":0},4,4]
[null,{"$f":"$B$63","v":"Senegal"},{"$f":"$C$63","v":0},{"$f":"$D$63","v":0},{"$f":"$E$63","v":0},{"$f":"$F$63","v":0},{"$f":"$G$63","v":0},{"$f":"$H$63","v":0},{"$f":"$I$63","v":0},{"$f":"$J$63","v":0},5,5]
[null,{"$f":"$B$14","v":"Canada"},{"$f":"$C$14","v":0},{"$f":"$D$14","v":0},{"$f":"$E$14","v":0},{"$f":"$F$14","v":0},{"$f":"$G$14","v":0},{"$f":"$H$14","v":0},{"$f":"$I$14","v":0},{"$f":"$J$14","v":0},6,6]
[null,{"$f":"$B$42","v":"(UKR,SWE,POL,ALB)"},{"$f":"$C$42","v":0},{"$f":"$D$42","v":0},{"$f":"$E$42","v":0},{"$f":"$F$42","v":0},{"$f":"$G$42","v":0},{"$f":"$H$42","v":0},{"$f":"$I$42","v":0},{"$f":"$J$42","v":0},7,7]
[null,{"$f":"$B$28","v":"(TUR,ROM,SVK,KOS)"},{"$f":"$C$28","v":0},{"$f":"$D$28","v":0},{"$f":"$E$28","v":0},{"$f":"$F$28","v":0},{"$f":"$G$28","v":0},{"$f":"$H$28","v":0},{"$f":"$I$28","v":0},{"$f":"$J$28","v":0},8,8]
[null,{"$f":"$B$48","v":"Egypt"},{"$f":"$C$48","v":0},{"$f":"$D$48","v":0},{"$f":"$E$48","v":0},{"$f":"$F$48","v":0},{"$f":"$G$48","v":0},{"$f":"$H$48","v":0},{"$f":"$I$48","v":0},{"$f":"$J$48","v":0},9,9]
[null,{"$f":"$B$21","v":"Morocco"},{"$f":"$C$21","v":0},{"$f":"$D$21","v":0},{"$f":"$E$21","v":0},{"$f":"$F$21","v":0},{"$f":"$G$21","v":0},{"$f":"$H$21","v":0},{"$f":"$I$21","v":0},{"$f":"$J$21","v":0},10,10]
[null,{"$f":"$B$35","v":"Ecuador"},{"$f":"$C$35","v":0},{"$f":"$D$35","v":0},{"$f":"$E$35","v":0},{"$f":"$F$35","v":0},{"$f":"$G$35","v":0},{"$f":"$H$35","v":0},{"$f":"$I$35","v":0},{"$f":"$J$35","v":0},11,11]
[null,{"$f":"$B$56","v":"Saudi Arabia"},{"$f":"$C$56","v":0},{"$f":"$D$56","v":0},{"$f":"$E$56","v":0},{"$f":"$F$56","v":0},{"$f":"$G$56","v":0},{"$f":"$H$56","v":0},{"$f":"$I$56","v":0},{"$f":"$J$56","v":0},12,12]
[]
[]
[null,"Thirds"]
[null,{"$f":"B91","v":"Incomplete"},{"$f":"C91","v":"P"},"W","D","L","F","A","GD","Pts"]
[null,{"$f":"B92","v":"(DEN/MKD/CZE/IRL)"},0,0,0,0,0,0,0,0]
[null,{"$f":"B93","v":"Uzbekistan"},0,0,0,0,0,0,0,0]
[null,{"$f":"B94","v":"Algeria"},0,0,0,0,0,0,0,0]
[null,{"$f":"B95","v":"Panama"},0,0,0,0,0,0,0,0]
[null,{"$f":"B96","v":"Senegal"},0,0,0,0,0,0,0,0]
[null,{"$f":"B97","v":"Canada"},0,0,0,0,0,0,0,0]
[null,{"$f":"B98","v":"(UKR,SWE,POL,ALB)"},0,0,0,0,0,0,0,0]
[null,{"$f":"B99","v":"(TUR,ROM,SVK,KOS)"},0,0,0,0,0,0,0,0]
[null,{"$f":"B100","v":"Egypt"},0,0,0,0,0,0,0,0]
[null,{"$f":"B101","v":"Morocco"},0,0,0,0,0,0,0,0]
[null,{"$f":"B102","v":"Ecuador"},0,0,0,0,0,0,0,0]
[null,{"$f":"B103","v":"Saudi Arabia"},0,0,0,0,0,0,0,0]